BDBM9245 (3R,3aS,6aR)-hexahydrofuro[2,3-b]furan-3-yl N-[(2S,3R)-3-hydroxy-4-(2-oxo-15-phenyl-1-oxa-3-azacyclopentadec-12-en-3-yl)-1-phenylbutan-2-yl]carbamate::Cyclourethane 16
SMILES: [H][C@@]1(CO[C@@]2([H])OCC[C@@]12[H])OC(=O)N[C@@H](Cc1ccccc1)[C@H](O)CN1CCCCCCCCC=CCC(OC1=O)c1ccccc1
InChI Key: InChIKey=FBXUJIUXHCKJLA-CTZGTMBNSA-N
Data: 1 KI
Activity Spreadsheet -- Enzyme Inhibition Constant Data from BindingDB
Found 1 hit for monomerid = 9245
Trg + Lig
Ki
nM
ΔG°
kcal/mole
IC50
nM
Kd
nM
EC50/IC50
nM
koff
s-1
kon
M-1s-1
pHTemp
°C
Dimer of Gag-Pol polyprotein [501-599,Q508K,L534I,L564I,C568A,C596A]
(Human immunodeficiency virus type 1)
BDBM9245
((3R,3aS,6aR)-hexahydrofuro[2,3-b]furan-3-yl N-[(2S...)
Show SMILES [H][C@@]1(CO[C@@]2([H])OCC[C@@]12[H])OC(=O)N[C@@H](Cc1ccccc1)[C@H](O)CN1CCCCCCCCC=CCC(OC1=O)c1ccccc1 |r,w:35.37|
Show InChI InChI=1S/C36H48N2O7/c39-31(30(24-27-16-10-8-11-17-27)37-35(40)44-33-26-43-34-29(33)21-23-42-34)25-38-22-15-7-5-3-1-2-4-6-14-20-32(45-36(38)41)28-18-12-9-13-19-28/h6,8-14,16-19,29-34,39H,1-5,7,15,20-26H2,(H,37,40)/t29-,30-,31+,32?,33-,34+/m0/s1
167 -9.24n/an/an/an/an/a6.425
University of Illinois at Chicago
Assay Description
The Ki values were determined using fluorogenic substrate, 2-(aminobenzoyl)-Thr-Ile-Nle-Phe(p-NO2)-Gln-ArgNH2. A standard curve relating changes in f...
Bioorg Med Chem Lett 12: 1993-6 (2002)
Article DOI: 10.1016/s0960-894x(02)00300-1
BindingDB Entry DOI: 10.7270/Q2SJ1HS5