BDBM92451 Cacodylate
SMILES: C[As](C)([O-])=O
InChI Key: InChIKey=OGGXGZAMXPVRFZ-UHFFFAOYSA-M
Data: 2 KI
PDB links: 444 PDB IDs match this monomer.
Activity Spreadsheet -- Enzyme Inhibition Constant Data from BindingDB
Found 2 hits for monomerid = 92451
Trg + Lig
Ki
nM
ΔG°
kcal/mole
IC50
nM
Kd
nM
EC50/IC50
nM
koff
s-1
kon
M-1s-1
pHTemp
°C
Glutaminyl Cyclase
(Homo sapiens (Human))
BDBM92451
(Cacodylate)
Show SMILES C[As](C)([O-])=O
Show InChI InChI=1S/C2H7AsO2/c1-3(2,4)5/h1-2H3,(H,4,5)/p-1
1.82E+6 -3.73n/an/an/an/an/a8.025
Academia Sinica
Assay Description
The testing for the inhibition activities of imidazole derivatives and cacodylate on gQC and sQC was evaluated at 25 C using the fluorescent substrat...
J Biol Chem 286: 12439-49 (2011)
Article DOI: 10.1074/jbc.M110.208595
BindingDB Entry DOI: 10.7270/Q2CN72HS
Glutaminyl Cyclase
(Homo sapiens (Human))
BDBM92451
(Cacodylate)
Show SMILES C[As](C)([O-])=O
Show InChI InChI=1S/C2H7AsO2/c1-3(2,4)5/h1-2H3,(H,4,5)/p-1
6.70E+6 -2.96n/an/an/an/an/a8.025
Academia Sinica
Assay Description
The testing for the inhibition activities of imidazole derivatives and cacodylate on gQC and sQC was evaluated at 25 C using the fluorescent substrat...
J Biol Chem 286: 12439-49 (2011)
Article DOI: 10.1074/jbc.M110.208595
BindingDB Entry DOI: 10.7270/Q2CN72HS