BDBM92482 CDE-008::US9120744, CDE-008
SMILES: Oc1cc(cc(O)c1O)C(=O)OCCOC(=O)c1cc(O)c(O)c(O)c1
InChI Key: InChIKey=PFTHQRBULKATPZ-UHFFFAOYSA-N
Data: 4 IC50  2 Kd
Activity Spreadsheet -- Enzyme Inhibition Constant Data from BindingDB
Found 6 hits for monomerid = 92482
Trg + Lig
Ki
nM
ΔG°
kcal/mole
IC50
nM
Kd
nM
EC50/IC50
nM
koff
s-1
kon
M-1s-1
pHTemp
°C
Urokinase-type plasminogen activator
(Homo sapiens (Human))
BDBM92482
(CDE-008 | US9120744, CDE-008)
Show SMILES Oc1cc(cc(O)c1O)C(=O)OCCOC(=O)c1cc(O)c(O)c(O)c1
Show InChI InChI=1S/C16H14O10/c17-9-3-7(4-10(18)13(9)21)15(23)25-1-2-26-16(24)8-5-11(19)14(22)12(20)6-8/h3-6,17-22H,1-2H2
Reactome pathway
n/an/a 44n/an/an/an/a7.823
University of Michigan
Assay Description
Enzyme activity assay using human and murine PAI-1.
J Biol Chem 285: 7892-902 (2010)
Article DOI: 10.1074/jbc.M109.067967
BindingDB Entry DOI: 10.7270/Q2ZC81FC
Urokinase-type plasminogen activator (uPA)
(Mus musculus (Mouse))
BDBM92482
(CDE-008 | US9120744, CDE-008)
Show SMILES Oc1cc(cc(O)c1O)C(=O)OCCOC(=O)c1cc(O)c(O)c(O)c1
Show InChI InChI=1S/C16H14O10/c17-9-3-7(4-10(18)13(9)21)15(23)25-1-2-26-16(24)8-5-11(19)14(22)12(20)6-8/h3-6,17-22H,1-2H2
Reactome pathway
n/an/a 162n/an/an/an/a7.823
University of Michigan
Assay Description
Enzyme activity assay using human and murine PAI-1.
J Biol Chem 285: 7892-902 (2010)
Article DOI: 10.1074/jbc.M109.067967
BindingDB Entry DOI: 10.7270/Q2ZC81FC
Plasminogen activator inhibitor-1
(Homo sapiens (Human))
BDBM92482
(CDE-008 | US9120744, CDE-008)
Show SMILES Oc1cc(cc(O)c1O)C(=O)OCCOC(=O)c1cc(O)c(O)c(O)c1
Show InChI InChI=1S/C16H14O10/c17-9-3-7(4-10(18)13(9)21)15(23)25-1-2-26-16(24)8-5-11(19)14(22)12(20)6-8/h3-6,17-22H,1-2H2
Reactome pathway
US Patent
n/an/an/a 23n/an/an/a5.023
THE REGENTS OF THE UNIVERSITY OF MICHIGAN; EASTERN MICHIGAN UNIVERSITY
US Patent
Assay Description
To establish binding constants for the compounds/drugs to PAI-1, an indirect approach using surface plasmon resonance (SPR) was employed. Varying con...
US Patent US9120744 (2015)
BindingDB Entry DOI: 10.7270/Q2QF8RN8
Plasminogen activator inhibitor-1
(Homo sapiens (Human))
BDBM92482
(CDE-008 | US9120744, CDE-008)
Show SMILES Oc1cc(cc(O)c1O)C(=O)OCCOC(=O)c1cc(O)c(O)c(O)c1
Show InChI InChI=1S/C16H14O10/c17-9-3-7(4-10(18)13(9)21)15(23)25-1-2-26-16(24)8-5-11(19)14(22)12(20)6-8/h3-6,17-22H,1-2H2
Reactome pathway
n/an/an/a 23n/an/an/a7.823
University of Michigan
Assay Description
Enzyme activity assay using human and murine PAI-1.
J Biol Chem 285: 7892-902 (2010)
Article DOI: 10.1074/jbc.M109.067967
BindingDB Entry DOI: 10.7270/Q2ZC81FC
Plasminogen activator inhibitor-1
(Homo sapiens (Human))
BDBM92482
(CDE-008 | US9120744, CDE-008)
Show SMILES Oc1cc(cc(O)c1O)C(=O)OCCOC(=O)c1cc(O)c(O)c(O)c1
Show InChI InChI=1S/C16H14O10/c17-9-3-7(4-10(18)13(9)21)15(23)25-1-2-26-16(24)8-5-11(19)14(22)12(20)6-8/h3-6,17-22H,1-2H2
Reactome pathway
US Patent
n/an/a 370n/an/an/an/a7.823
THE REGENTS OF THE UNIVERSITY OF MICHIGAN; EASTERN MICHIGAN UNIVERSITY
US Patent
Assay Description
To determine the efficacy of various synthesized PAI-1 inhibitor compounds, a fluorometric plate assay was carried out to measure the half maximal in...
US Patent US9120744 (2015)
BindingDB Entry DOI: 10.7270/Q2QF8RN8
Tissue-type plasminogen activator
(Homo sapiens (Human))
BDBM92482
(CDE-008 | US9120744, CDE-008)
Show SMILES Oc1cc(cc(O)c1O)C(=O)OCCOC(=O)c1cc(O)c(O)c(O)c1
Show InChI InChI=1S/C16H14O10/c17-9-3-7(4-10(18)13(9)21)15(23)25-1-2-26-16(24)8-5-11(19)14(22)12(20)6-8/h3-6,17-22H,1-2H2
NCI pathway
Reactome pathway
n/an/a>1.00E+4n/an/an/an/a7.823
University of Michigan
Assay Description
Enzyme activity assay using human and murine PAI-1.
J Biol Chem 285: 7892-902 (2010)
Article DOI: 10.1074/jbc.M109.067967
BindingDB Entry DOI: 10.7270/Q2ZC81FC