BDBM92496 Isocitrate
SMILES: OC(C(CC(O)=O)C(O)=O)C(O)=O
InChI Key: InChIKey=ODBLHEXUDAPZAU-UHFFFAOYSA-N
Data: 1 Kd  1 ITC
Activity Spreadsheet -- Enzyme Inhibition Constant Data from BindingDB
Found 1 hit for monomerid = 92496
Trg + Lig
Ki
nM
ΔG°
kcal/mole
IC50
nM
Kd
nM
EC50/IC50
nM
koff
s-1
kon
M-1s-1
pHTemp
°C
Methyl-accepting chemotaxis protein (McpS)
(Pseudomonas putida (Arthrobacter siderocapsulatus))
BDBM92496
(Isocitrate)
Show SMILES OC(C(CC(O)=O)C(O)=O)C(O)=O
Show InChI InChI=1S/C6H8O7/c7-3(8)1-2(5(10)11)4(9)6(12)13/h2,4,9H,1H2,(H,7,8)(H,10,11)(H,12,13)
n/an/an/a 3.37E+5n/an/an/an/a20
CSIC
Assay Description
Measurements were done on a VP-microcalorimeter (MicroCal, Amherst, MA).
J Biol Chem 285: 23126-36 (2010)
Article DOI: 10.1074/jbc.M110.110403
BindingDB Entry DOI: 10.7270/Q2K64GNS
Activity Spreadsheet -- ITC Data from BindingDB
Found 1 hit for monomerid = 92496
Cell (A)Syringe (B)Cell
Syringe
Cell + Syr
ΔG°
kcal/mole
-TΔS°
kcal/mole
ΔH°
kcal/mole
log KpHTemp
°C
Methyl-accepting chemotaxis protein (McpS)
(Pseudomonas putida (Arthrobacter siderocapsulatus))
BDBM92496
JPEG
(Isocitrate)
-4.664.20-8.843.48n/a20
CSIC
J Biol Chem 285: 23126-36 (2010)