BDBM92511 JFD 03990, 7
SMILES: O=C(Oc1cc(=O)n(-c2ccccc2)c2ccccc12)c1ccccc1
InChI Key: InChIKey=HABAAYNEGSCYIM-UHFFFAOYSA-N
Data: 1 KI  1 IC50
Activity Spreadsheet -- Enzyme Inhibition Constant Data from BindingDB
Found 1 hit for monomerid = 92511
Trg + Lig
Ki
nM
ΔG°
kcal/mole
IC50
nM
Kd
nM
EC50/IC50
nM
koff
s-1
kon
M-1s-1
pHTemp
°C
Macrophage migration inhibitory factor (MIF)
(Homo sapiens (Human))
BDBM92511
(JFD 03990, 7)
Show SMILES O=C(Oc1cc(=O)n(-c2ccccc2)c2ccccc12)c1ccccc1
Show InChI InChI=1S/C22H15NO3/c24-21-15-20(26-22(25)16-9-3-1-4-10-16)18-13-7-8-14-19(18)23(21)17-11-5-2-6-12-17/h1-15H
230n/a 1.55E+3n/an/an/an/a6.5n/a
Ecole Polytechnique Fédérale de Lausanne
Assay Description
The assay principle is based on measuring the absorbance of D-dopachrome methyl ester (red), which is transformed by enzymatically active MIF to the ...
J Biol Chem 285: 26581-98 (2010)
Article DOI: 10.1074/jbc.M110.113951
BindingDB Entry DOI: 10.7270/Q2XD1083