BDBM92562 Hit compound, 3
SMILES: Oc1ccc(cc1)\N=C\c1c(O)ccc2ccccc12
InChI Key: InChIKey=KPLUVIWNJYXFQT-WOJGMQOQSA-N
Data: 1 IC50
PDB links: 1 PDB ID matches this monomer.
Activity Spreadsheet -- Enzyme Inhibition Constant Data from BindingDB
Found 1 hit for monomerid = 92562
Trg + Lig
Ki
nM
ΔG°
kcal/mole
IC50
nM
Kd
nM
EC50/IC50
nM
koff
s-1
kon
M-1s-1
pHTemp
°C
Cyclin-dependent kinase 2
(Homo sapiens (Human))
BDBM92562
(Hit compound, 3)
Show SMILES Oc1ccc(cc1)\N=C\c1c(O)ccc2ccccc12
Show InChI InChI=1S/C17H13NO2/c19-14-8-6-13(7-9-14)18-11-16-15-4-2-1-3-12(15)5-10-17(16)20/h1-11,19-20H/b18-11+
NCI pathway
Reactome pathway
n/an/a>1.50E+5n/an/an/an/an/an/a
Moffitt Cancer Center and Research Institute
Assay Description
The inhibitory against activated CDK2-cyclin A2 complex was determined by using the ADP Quest fluorescence assay from (DiscoveRX, Fremont, CA)
Chembiochem 13: 2128-36 (2012)
Article DOI: 10.1002/cbic.201200316
BindingDB Entry DOI: 10.7270/Q2154FN2
3D
3D Structure (crystal)