BDBM92633 Thiazolidine-dione, 2
SMILES: CC(=C)CN1C(SC(=C)C1=O)=NN=c1scc(O)n1C
InChI Key: InChIKey=MGXJFHQMSHIMIV-UHFFFAOYSA-N
Data: 5 IC50
Activity Spreadsheet -- Enzyme Inhibition Constant Data from BindingDB
Found 5 hits for monomerid = 92633
Trg + Lig
Ki
nM
ΔG°
kcal/mole
IC50
nM
Kd
nM
EC50/IC50
nM
koff
s-1
kon
M-1s-1
pHTemp
°C
Epidermal growth factor receptor
(Homo sapiens (Human))
BDBM92633
(Thiazolidine-dione, 2)
Show SMILES CC(=C)CN1C(SC(=C)C1=O)=NN=c1scc(O)n1C |w:12.12,5.5|
Show InChI InChI=1S/C12H14N4O2S2/c1-7(2)5-16-10(18)8(3)20-12(16)14-13-11-15(4)9(17)6-19-11/h6,17H,1,3,5H2,2,4H3
n/an/a 1.00E+3n/an/an/an/an/an/a
Ciba-Geigy Ltd.
Assay Description
Determination of EGF receptor kinase activity was performed as described using A431 membranes as the enzyme source and agiotensin II as substrate.
J Biol Chem 265: 22255-61 (1990)
BindingDB Entry DOI: 10.7270/Q2319TGH
Tyrosine-protein kinase ABL1
(Homo sapiens (Human))
BDBM92633
(Thiazolidine-dione, 2)
Show SMILES CC(=C)CN1C(SC(=C)C1=O)=NN=c1scc(O)n1C |w:12.12,5.5|
Show InChI InChI=1S/C12H14N4O2S2/c1-7(2)5-16-10(18)8(3)20-12(16)14-13-11-15(4)9(17)6-19-11/h6,17H,1,3,5H2,2,4H3
Reactome pathway
n/an/a 1.00E+5n/an/an/an/an/an/a
Ciba-Geigy Ltd.
Assay Description
Determination of EGF receptor kinase activity was performed as described using A431 membranes as the enzyme source and agiotensin II as substrate.
J Biol Chem 265: 22255-61 (1990)
BindingDB Entry DOI: 10.7270/Q2319TGH
cAMP-dependent protein kinase (PKA)
(Homo sapiens (Human))
BDBM92633
(Thiazolidine-dione, 2)
Show SMILES CC(=C)CN1C(SC(=C)C1=O)=NN=c1scc(O)n1C |w:12.12,5.5|
Show InChI InChI=1S/C12H14N4O2S2/c1-7(2)5-16-10(18)8(3)20-12(16)14-13-11-15(4)9(17)6-19-11/h6,17H,1,3,5H2,2,4H3
NCI pathway
Reactome pathway
n/an/a>5.00E+5n/an/an/an/an/an/a
Ciba-Geigy Ltd.
Assay Description
Determination of EGF receptor kinase activity was performed as described using A431 membranes as the enzyme source and agiotensin II as substrate.
J Biol Chem 265: 22255-61 (1990)
BindingDB Entry DOI: 10.7270/Q2319TGH
Protein kinase C alpha type
(Homo sapiens (Human))
BDBM92633
(Thiazolidine-dione, 2)
Show SMILES CC(=C)CN1C(SC(=C)C1=O)=NN=c1scc(O)n1C |w:12.12,5.5|
Show InChI InChI=1S/C12H14N4O2S2/c1-7(2)5-16-10(18)8(3)20-12(16)14-13-11-15(4)9(17)6-19-11/h6,17H,1,3,5H2,2,4H3
NCI pathway
Reactome pathway
n/an/a>1.00E+5n/an/an/an/an/an/a
Ciba-Geigy Ltd.
Assay Description
Determination of EGF receptor kinase activity was performed as described using A431 membranes as the enzyme source and agiotensin II as substrate.
J Biol Chem 265: 22255-61 (1990)
BindingDB Entry DOI: 10.7270/Q2319TGH
Tyrosine-protein kinase CSK
(Homo sapiens (Human))
BDBM92633
(Thiazolidine-dione, 2)
Show SMILES CC(=C)CN1C(SC(=C)C1=O)=NN=c1scc(O)n1C |w:12.12,5.5|
Show InChI InChI=1S/C12H14N4O2S2/c1-7(2)5-16-10(18)8(3)20-12(16)14-13-11-15(4)9(17)6-19-11/h6,17H,1,3,5H2,2,4H3
NCI pathway
Reactome pathway
n/an/a 3.00E+3n/an/an/an/an/an/a
Ciba-Geigy Ltd.
Assay Description
Determination of EGF receptor kinase activity was performed as described using A431 membranes as the enzyme source and agiotensin II as substrate.
J Biol Chem 265: 22255-61 (1990)
BindingDB Entry DOI: 10.7270/Q2319TGH