BDBM92646 EPZ003647
SMILES: CN(CCNC(=O)Nc1ccc(cc1)C(C)(C)C)CC1OC([C@H](O)[C@@H]1O)n1cnc2c(N)ncnc12
InChI Key: InChIKey=XIHLTKHOHKQVLN-NXMQOFKUSA-N
Data: 1 KI  1 Kd
Activity Spreadsheet -- Enzyme Inhibition Constant Data from BindingDB
Found 1 hit for monomerid = 92646
Trg + Lig
Ki
nM
ΔG°
kcal/mole
IC50
nM
Kd
nM
EC50/IC50
nM
koff
s-1
kon
M-1s-1
pHTemp
°C
Histone-lysine N-methyltransferase, H3 lysine-79 specific
(Homo sapiens (Human))
BDBM92646
(EPZ003647)
Show SMILES CN(CCNC(=O)Nc1ccc(cc1)C(C)(C)C)CC1OC([C@H](O)[C@@H]1O)n1cnc2c(N)ncnc12 |r|
Show InChI InChI=1S/C24H34N8O4/c1-24(2,3)14-5-7-15(8-6-14)30-23(35)26-9-10-31(4)11-16-18(33)19(34)22(36-16)32-13-29-17-20(25)27-12-28-21(17)32/h5-8,12-13,16,18-19,22,33-34H,9-11H2,1-4H3,(H2,25,27,28)(H2,26,30,35)/t16?,18-,19-,22?/m1/s1
845n/an/a 167n/an/an/an/an/a
Epizyme Inc.
Assay Description
Assay of DOT1L enzymatic activity were performed under balanced conditions using a radiometric assay.
Chem Biol Drug Des 80: 971-80 (2012)
Article DOI: 10.1111/cbdd.12050
BindingDB Entry DOI: 10.7270/Q2Z89B12