BDBM92793 Bisanilinopyrimidine, 3g
SMILES: NC(=O)c1ccc(Nc2nccc(Nc3ccccc3C(N)=O)n2)cc1
InChI Key: InChIKey=DYZNHQCKJOEZRJ-UHFFFAOYSA-N
Data: 1 IC50
PDB links: 1 PDB ID matches this monomer.
Activity Spreadsheet -- Enzyme Inhibition Constant Data from BindingDB
Found 1 hit for monomerid = 92793
Trg + Lig
Ki
nM
ΔG°
kcal/mole
IC50
nM
Kd
nM
EC50/IC50
nM
koff
s-1
kon
M-1s-1
pHTemp
°C
Aurora kinase A
(Homo sapiens (Human))
BDBM92793
(Bisanilinopyrimidine, 3g)
Show SMILES NC(=O)c1ccc(Nc2nccc(Nc3ccccc3C(N)=O)n2)cc1
Show InChI InChI=1S/C18H16N6O2/c19-16(25)11-5-7-12(8-6-11)22-18-21-10-9-15(24-18)23-14-4-2-1-3-13(14)17(20)26/h1-10H,(H2,19,25)(H2,20,26)(H2,21,22,23,24)
NCI pathway
Reactome pathway
n/an/a 38.2n/an/an/an/an/an/a
Moffitt Cancer Center
Assay Description
In vitro enzyme activity assay using Aurora Kinase A.
J Med Chem 55: 7392-416 (2012)
Article DOI: 10.1021/jm300334d
BindingDB Entry DOI: 10.7270/Q2V986NH
3D
3D Structure (crystal)