BDBM928 5PhBuCOOH deriv.::Statine deriv. 8::Tle-Val-Sta::benzyl N-[(1S)-1-{[(2S,3R,4R)-4-{[(1S)-1-(benzylcarbamoyl)-2-methylpropyl]carbamoyl}-3-hydroxy-1-phenyl-4-(phenylamino)butan-2-yl]carbamoyl}-2-methylpropyl]carbamate
SMILES: CC(C)[C@H](NC(=O)OCc1ccccc1)C(=O)N[C@@H](Cc1ccccc1)[C@@H](O)[C@@H](Nc1ccccc1)C(=O)N[C@@H](C(C)C)C(=O)NCc1ccccc1
InChI Key: InChIKey=GMQZRGYLNOBSEZ-LOFFRUMASA-N
Data: 2 KI
Activity Spreadsheet -- Enzyme Inhibition Constant Data from BindingDB
Found 2 hits for monomerid = 928
Trg + Lig
Ki
nM
ΔG°
kcal/mole
IC50
nM
Kd
nM
EC50/IC50
nM
koff
s-1
kon
M-1s-1
pHTemp
°C
HIV-1 Protease
(Human immunodeficiency virus type 1)
BDBM928
(5PhBuCOOH deriv. | Statine deriv. 8 | Tle-Val-Sta ...)
Show SMILES CC(C)[C@H](NC(=O)OCc1ccccc1)C(=O)N[C@@H](Cc1ccccc1)[C@@H](O)[C@@H](Nc1ccccc1)C(=O)N[C@@H](C(C)C)C(=O)NCc1ccccc1 |r|
Show InChI InChI=1S/C42H51N5O6/c1-28(2)35(39(49)43-26-31-19-11-6-12-20-31)46-41(51)37(44-33-23-15-8-16-24-33)38(48)34(25-30-17-9-5-10-18-30)45-40(50)36(29(3)4)47-42(52)53-27-32-21-13-7-14-22-32/h5-24,28-29,34-38,44,48H,25-27H2,1-4H3,(H,43,49)(H,45,50)(H,46,51)(H,47,52)/t34-,35-,36-,37+,38+/m0/s1
6.90 -11.6n/an/an/an/an/a6.2537
SANDOZ Forschungsinstitut Ges.m.b.H.
Assay Description
Enzymatic activity was measured by following cleavage of the substrate H-Lys-Ala-Arg-Val-Leu-pNph-Glu-Ala-Nle-NH2. Products of the cleavage reaction ...
J Med Chem 37: 3079-89 (1994)
Article DOI: 10.1021/jm00045a013
BindingDB Entry DOI: 10.7270/Q21J97XV
Human immunodeficiency virus type 1 protease
(Human immunodeficiency virus type 1)
BDBM928
(5PhBuCOOH deriv. | Statine deriv. 8 | Tle-Val-Sta ...)
Show SMILES CC(C)[C@H](NC(=O)OCc1ccccc1)C(=O)N[C@@H](Cc1ccccc1)[C@@H](O)[C@@H](Nc1ccccc1)C(=O)N[C@@H](C(C)C)C(=O)NCc1ccccc1 |r|
Show InChI InChI=1S/C42H51N5O6/c1-28(2)35(39(49)43-26-31-19-11-6-12-20-31)46-41(51)37(44-33-23-15-8-16-24-33)38(48)34(25-30-17-9-5-10-18-30)45-40(50)36(29(3)4)47-42(52)53-27-32-21-13-7-14-22-32/h5-24,28-29,34-38,44,48H,25-27H2,1-4H3,(H,43,49)(H,45,50)(H,46,51)(H,47,52)/t34-,35-,36-,37+,38+/m0/s1
6.92n/an/an/an/an/an/an/an/a
SANDOZ Forschungsinstitut Ges. m.b.H
Curated by ChEMBL
Assay Description
Inhibitory activity was determined against HIV type 1 protease
J Med Chem 38: 4917-28 (1996)
BindingDB Entry DOI: 10.7270/Q2FX7BN8