null
SMILES: OC(=O)c1ccc(Nc2nc(Cl)c(Cl)c(Nc3ccccc3C(O)=O)n2)cc1
InChI Key: InChIKey=CDGKKEPAUJAQHQ-UHFFFAOYSA-N
Activity Spreadsheet -- Enzyme Inhibition Constant Data from BindingDB
Found 2 hits for monomerid = 92804
Trg + Lig
Ki
nM
ΔG°
kcal/mole
IC50
nM
Kd
nM
EC50/IC50
nM
koff
s-1
kon
M-1s-1
pHTemp
°C
Aurora kinase A
(Homo sapiens (Human))
BDBM92804
(Bisanilinopyrimidine, 4c | US9249124, 20)
Show SMILES OC(=O)c1ccc(Nc2nc(Cl)c(Cl)c(Nc3ccccc3C(O)=O)n2)cc1
Show InChI InChI=1S/C18H12Cl2N4O4/c19-13-14(20)23-18(21-10-7-5-9(6-8-10)16(25)26)24-15(13)22-12-4-2-1-3-11(12)17(27)28/h1-8H,(H,25,26)(H,27,28)(H2,21,22,23,24)
NCI pathway
Reactome pathway
US Patent
n/an/a 1.49E+3n/an/an/an/a7.425
H. Lee Moffitt Cancer Center and Research Institute, Inc.
US Patent
Assay Description
Reactions were carried out at room temperature in 15 mM HEPES buffer (pH 7.4) containing 20 mM NaCl, 1 mM EGTA, 0.02% Tween 20, 10 mM MgCl2, 5% (v/v)...
US Patent US9249124 (2016)
BindingDB Entry DOI: 10.7270/Q2J1020R
Aurora kinase A
(Homo sapiens (Human))
BDBM92804
(Bisanilinopyrimidine, 4c | US9249124, 20)
Show SMILES OC(=O)c1ccc(Nc2nc(Cl)c(Cl)c(Nc3ccccc3C(O)=O)n2)cc1
Show InChI InChI=1S/C18H12Cl2N4O4/c19-13-14(20)23-18(21-10-7-5-9(6-8-10)16(25)26)24-15(13)22-12-4-2-1-3-11(12)17(27)28/h1-8H,(H,25,26)(H,27,28)(H2,21,22,23,24)
NCI pathway
Reactome pathway
n/an/a 1.49E+3n/an/an/an/an/an/a
Moffitt Cancer Center
Assay Description
In vitro enzyme activity assay using Aurora Kinase A.
J Med Chem 55: 7392-416 (2012)
Article DOI: 10.1021/jm300334d
BindingDB Entry DOI: 10.7270/Q2V986NH