BDBM92920 Benzofuranone, 9
SMILES: COc1ccc2OC3(Cc4ccccc4C3)C(=O)c2c1
InChI Key: InChIKey=DXZKRSOLMVQTMF-UHFFFAOYSA-N
Data: 2 KI
Activity Spreadsheet -- Enzyme Inhibition Constant Data from BindingDB
Found 2 hits for monomerid = 92920
Trg + Lig
Ki
nM
ΔG°
kcal/mole
IC50
nM
Kd
nM
EC50/IC50
nM
koff
s-1
kon
M-1s-1
pHTemp
°C
Cyclophilin B (CypB)
(Homo sapiens (Human))
BDBM92920
(Benzofuranone, 9)
Show SMILES COc1ccc2OC3(Cc4ccccc4C3)C(=O)c2c1
Show InChI InChI=1S/C17H14O3/c1-19-13-6-7-15-14(8-13)16(18)17(20-15)9-11-4-2-3-5-12(11)10-17/h2-8H,9-10H2,1H3
Reactome pathway
6.30E+4 -5.34n/an/an/an/an/a7.85
Max Planck Research
Assay Description
PPIase activity assay were performed at 283 K in quartz cuvettes with a path length of 1 cm under vigorous stirring with a Hewlett-Packard 8453A UV-v...
Biochemistry 48: 6268-77 (2009)
Article DOI: 10.1021/bi9007287
BindingDB Entry DOI: 10.7270/Q2X34W26
Peptidyl-prolyl cis-trans isomerase A
(Homo sapiens (Human))
BDBM92920
(Benzofuranone, 9)
Show SMILES COc1ccc2OC3(Cc4ccccc4C3)C(=O)c2c1
Show InChI InChI=1S/C17H14O3/c1-19-13-6-7-15-14(8-13)16(18)17(20-15)9-11-4-2-3-5-12(11)10-17/h2-8H,9-10H2,1H3
Reactome pathway
>1.00E+5>-5.09n/an/an/an/an/a7.85
Max Planck Research
Assay Description
PPIase activity assay were performed at 283 K in quartz cuvettes with a path length of 1 cm under vigorous stirring with a Hewlett-Packard 8453A UV-v...
Biochemistry 48: 6268-77 (2009)
Article DOI: 10.1021/bi9007287
BindingDB Entry DOI: 10.7270/Q2X34W26