BDBM9294 (3S,4aS,8aS)-N-tert-butyl-2-[(2R,3S)-2-hydroxy-3-[(2S)-3-methyl-2-(quinolin-2-ylformamido)butanamido]-4-phenylbutyl]-decahydroisoquinoline-3-carboxamide::Ro 31-8959 (Saquinavir) analog 26
SMILES: CC(C)[C@H](NC(=O)c1ccc2ccccc2n1)C(=O)N[C@@H](Cc1ccccc1)[C@H](O)CN1C[C@H]2CCCC[C@H]2C[C@H]1C(=O)NC(C)(C)C
InChI Key: InChIKey=NIQINMSYVZRSSS-MSNCXEFOSA-N
Data: 1 KI  1 IC50
PDB links: 7 PDB IDs contain inhibitors having a similarity of 90% to this monomer.
Activity Spreadsheet -- Enzyme Inhibition Constant Data from BindingDB
Found 2 hits for monomerid = 9294
Trg + Lig
Ki
nM
ΔG°
kcal/mole
IC50
nM
Kd
nM
EC50/IC50
nM
koff
s-1
kon
M-1s-1
pHTemp
°C
Human immunodeficiency virus type 1 protease
(Human immunodeficiency virus type 1)
BDBM9294
((3S,4aS,8aS)-N-tert-butyl-2-[(2R,3S)-2-hydroxy-3-[...)
Show SMILES CC(C)[C@H](NC(=O)c1ccc2ccccc2n1)C(=O)N[C@@H](Cc1ccccc1)[C@H](O)CN1C[C@H]2CCCC[C@H]2C[C@H]1C(=O)NC(C)(C)C |r|
Show InChI InChI=1S/C39H53N5O4/c1-25(2)35(42-36(46)31-20-19-27-15-11-12-18-30(27)40-31)38(48)41-32(21-26-13-7-6-8-14-26)34(45)24-44-23-29-17-10-9-16-28(29)22-33(44)37(47)43-39(3,4)5/h6-8,11-15,18-20,25,28-29,32-35,45H,9-10,16-17,21-24H2,1-5H3,(H,41,48)(H,42,46)(H,43,47)/t28-,29+,32-,33-,34+,35-/m0/s1
0.550n/an/an/an/an/an/an/an/a
TBA
Curated by ChEMBL
Assay Description
Inhibitory activity against P2 site in HIV protease.
Bioorg Med Chem Lett 6: 585-588 (1996)
Article DOI: 10.1016/0960-894X(96)00086-8
BindingDB Entry DOI: 10.7270/Q2KH0N9Z
HIV-1 Protease
(Human immunodeficiency virus type 1)
BDBM9294
((3S,4aS,8aS)-N-tert-butyl-2-[(2R,3S)-2-hydroxy-3-[...)
Show SMILES CC(C)[C@H](NC(=O)c1ccc2ccccc2n1)C(=O)N[C@@H](Cc1ccccc1)[C@H](O)CN1C[C@H]2CCCC[C@H]2C[C@H]1C(=O)NC(C)(C)C |r|
Show InChI InChI=1S/C39H53N5O4/c1-25(2)35(42-36(46)31-20-19-27-15-11-12-18-30(27)40-31)38(48)41-32(21-26-13-7-6-8-14-26)34(45)24-44-23-29-17-10-9-16-28(29)22-33(44)37(47)43-39(3,4)5/h6-8,11-15,18-20,25,28-29,32-35,45H,9-10,16-17,21-24H2,1-5H3,(H,41,48)(H,42,46)(H,43,47)/t28-,29+,32-,33-,34+,35-/m0/s1
n/an/a 0.700n/an/an/an/a5.530
Merck Research Laboratories
Assay Description
Sensitivity of HIV-1 protease activity to protease inhibitors was determined by a peptide substrate cleavage assay. The products were analyzed by usi...
J Med Chem 36: 2300-10 (1993)
Article DOI: 10.1021/jm00068a006
BindingDB Entry DOI: 10.7270/Q28G8HX8