BDBM92970 Amphiphile, V
SMILES: CC(C)CCCC(C)C1CCC2C3CC=C4CC(CCC4(C)C3CCC12C)C(=O)OC(C[NH+](C)C)C[NH+](C)C
InChI Key: InChIKey=UEXPHEDRMPUVEH-UHFFFAOYSA-P
Data: 1 IC50
Activity Spreadsheet -- Enzyme Inhibition Constant Data from BindingDB
Found 1 hit for monomerid = 92970
Trg + Lig
Ki
nM
ΔG°
kcal/mole
IC50
nM
Kd
nM
EC50/IC50
nM
koff
s-1
kon
M-1s-1
pHTemp
°C
Protein kinase C alpha
(Rattus norvegicus (Rat))
BDBM92970
(Amphiphile, V)
Show SMILES CC(C)CCCC(C)C1CCC2C3CC=C4CC(CCC4(C)C3CCC12C)C(=O)OC(C[NH+](C)C)C[NH+](C)C |t:14|
Show InChI InChI=1S/C35H62N2O2/c1-24(2)11-10-12-25(3)30-15-16-31-29-14-13-27-21-26(33(38)39-28(22-36(6)7)23-37(8)9)17-19-34(27,4)32(29)18-20-35(30,31)5/h13,24-26,28-32H,10-12,14-23H2,1-9H3/p+2
Reactome pathway
n/an/a 6.43E+5n/an/an/an/a7.530
McMaster University
Assay Description
The triton X-100 assay previously described by Bell and co-workers were used to measure enzyme activity.
Biochemistry 31: 9025-30 (1992)
Article DOI: 10.1021/bi00152a045
BindingDB Entry DOI: 10.7270/Q2W66JCK