BDBM92972 Amphiphile, VII
SMILES: CC(C)CCCC(C)C1CCC2C3CC=C4CC(CCC4(C)C3CCC12C)C(=O)NCC[NH3+]
InChI Key: InChIKey=AVHDOASDQVZPJS-UHFFFAOYSA-O
Data: 1 IC50
Activity Spreadsheet -- Enzyme Inhibition Constant Data from BindingDB
Found 1 hit for monomerid = 92972
Trg + Lig
Ki
nM
ΔG°
kcal/mole
IC50
nM
Kd
nM
EC50/IC50
nM
koff
s-1
kon
M-1s-1
pHTemp
°C
Protein kinase C alpha
(Rattus norvegicus (Rat))
BDBM92972
(Amphiphile, VII)
Show SMILES CC(C)CCCC(C)C1CCC2C3CC=C4CC(CCC4(C)C3CCC12C)C(=O)NCC[NH3+] |t:14|
Show InChI InChI=1S/C30H52N2O/c1-20(2)7-6-8-21(3)25-11-12-26-24-10-9-23-19-22(28(33)32-18-17-31)13-15-29(23,4)27(24)14-16-30(25,26)5/h9,20-22,24-27H,6-8,10-19,31H2,1-5H3,(H,32,33)/p+1
Reactome pathway
n/an/a 2.46E+5n/an/an/an/a7.530
McMaster University
Assay Description
The triton X-100 assay previously described by Bell and co-workers were used to measure enzyme activity.
Biochemistry 31: 9025-30 (1992)
Article DOI: 10.1021/bi00152a045
BindingDB Entry DOI: 10.7270/Q2W66JCK