BDBM92973 Amphiphile, VIII
SMILES: CC(C)CCCC(N)C1CCN2C3OC=C4CC(CCC4(C)C3CCC12C)OC(=O)CCC(=O)NCC[NH+](C)C
InChI Key: InChIKey=QJNGHDKYHRJAFL-UHFFFAOYSA-O
Data: 1 IC50
Activity Spreadsheet -- Enzyme Inhibition Constant Data from BindingDB
Found 1 hit for monomerid = 92973
Trg + Lig
Ki
nM
ΔG°
kcal/mole
IC50
nM
Kd
nM
EC50/IC50
nM
koff
s-1
kon
M-1s-1
pHTemp
°C
Protein kinase C alpha type
(Rattus norvegicus (Rat))
BDBM92973
(Amphiphile, VIII)
Show SMILES CC(C)CCCC(N)C1CCN2C3OC=C4CC(CCC4(C)C3CCC12C)OC(=O)CCC(=O)NCC[NH+](C)C |t:14|
Show InChI InChI=1S/C32H56N4O4/c1-22(2)8-7-9-27(33)25-14-18-36-30-26(13-16-32(25,36)4)31(3)15-12-24(20-23(31)21-39-30)40-29(38)11-10-28(37)34-17-19-35(5)6/h21-22,24-27,30H,7-20,33H2,1-6H3,(H,34,37)/p+1
Reactome pathway
n/an/a 1.91E+5n/an/an/an/a7.530
McMaster University
Assay Description
The triton X-100 assay previously described by Bell and co-workers were used to measure enzyme activity.
Biochemistry 31: 9025-30 (1992)
Article DOI: 10.1021/bi00152a045
BindingDB Entry DOI: 10.7270/Q2W66JCK