BDBM93042 Indole, 2
SMILES: Cc1ccc2[nH]ccc2c1
InChI Key: InChIKey=YPKBCLZFIYBSHK-UHFFFAOYSA-N
Data: 1 Kd
PDB links: 1 PDB ID matches this monomer.
Activity Spreadsheet -- Enzyme Inhibition Constant Data from BindingDB
Found 1 hit for monomerid = 93042
Trg + Lig
Ki
nM
ΔG°
kcal/mole
IC50
nM
Kd
nM
EC50/IC50
nM
koff
s-1
kon
M-1s-1
pHTemp
°C
DNA repair and recombination protein (RadA)
(Pyrococcus furiosus)
BDBM93042
(Indole, 2)
Show SMILES Cc1ccc2[nH]ccc2c1
Show InChI InChI=1S/C9H9N/c1-7-2-3-9-8(6-7)4-5-10-9/h2-6,10H,1H3
n/an/an/a 2.10E+6n/an/an/an/an/a
University of Cambridge
Assay Description
The thermal-shift denaturation assay was performed on an iCycler iQ Real Time Detection System (BioRad) in 96-well iCycler iQ PCR plates sealed with ...
Chembiochem 14: 332-42 (2013)
Article DOI: 10.1002/cbic.201200521
BindingDB Entry DOI: 10.7270/Q2QF8RHG
3D
3D Structure (crystal)