BDBM9305 (3S,4aS,8aS)-N-tert-butyl-2-[(2R,3S)-3-[(2S)-2-{[6-chloro-5-(dimethylamino)pyrazin-2-yl]formamido}-2-[(3R)-oxolan-3-yl]acetamido]-2-hydroxy-4-phenylbutyl]-decahydroisoquinoline-3-carboxamide::Ro 31-8959 (Saquinavir) analog 40
SMILES: CN(C)c1ncc(nc1Cl)C(=O)N[C@@H]([C@H]1CCOC1)C(=O)N[C@@H](Cc1ccccc1)[C@H](O)CN1C[C@H]2CCCC[C@H]2C[C@H]1C(=O)NC(C)(C)C
InChI Key: InChIKey=BIHYGUVPMSZAHD-ULAXQUARSA-N
Data: 1 IC50
Activity Spreadsheet -- Enzyme Inhibition Constant Data from BindingDB
Found 1 hit for monomerid = 9305
Trg + Lig
Ki
nM
ΔG°
kcal/mole
IC50
nM
Kd
nM
EC50/IC50
nM
koff
s-1
kon
M-1s-1
pHTemp
°C
HIV-1 Protease
(Human immunodeficiency virus type 1)
BDBM9305
((3S,4aS,8aS)-N-tert-butyl-2-[(2R,3S)-3-[(2S)-2-{[6...)
Show SMILES CN(C)c1ncc(nc1Cl)C(=O)N[C@@H]([C@H]1CCOC1)C(=O)N[C@@H](Cc1ccccc1)[C@H](O)CN1C[C@H]2CCCC[C@H]2C[C@H]1C(=O)NC(C)(C)C |r|
Show InChI InChI=1S/C37H54ClN7O5/c1-37(2,3)43-35(48)29-18-24-13-9-10-14-25(24)20-45(29)21-30(46)27(17-23-11-7-6-8-12-23)41-36(49)31(26-15-16-50-22-26)42-34(47)28-19-39-33(44(4)5)32(38)40-28/h6-8,11-12,19,24-27,29-31,46H,9-10,13-18,20-22H2,1-5H3,(H,41,49)(H,42,47)(H,43,48)/t24-,25+,26-,27-,29-,30+,31-/m0/s1
n/an/a 0.0600n/an/an/an/a5.530
Merck Research Laboratories
Assay Description
Sensitivity of HIV-1 protease activity to protease inhibitors was determined by a peptide substrate cleavage assay. The products were analyzed by usi...
J Med Chem 36: 2300-10 (1993)
Article DOI: 10.1021/jm00068a006
BindingDB Entry DOI: 10.7270/Q28G8HX8