BDBM93147 2-oxoimidazolidine-1-carboxamide, 14
SMILES: CC(=O)Nc1cc(Oc2ccc(NC(=O)N3CCN(C3=O)c3ccc(F)cc3)cc2)ccn1
InChI Key: InChIKey=NRKCVYBUESLYHR-UHFFFAOYSA-N
Data: 1 IC50
Activity Spreadsheet -- Enzyme Inhibition Constant Data from BindingDB
Found 1 hit for monomerid = 93147
Trg + Lig
Ki
nM
ΔG°
kcal/mole
IC50
nM
Kd
nM
EC50/IC50
nM
koff
s-1
kon
M-1s-1
pHTemp
°C
High affinity nerve growth factor receptor
(Homo sapiens (Human))
BDBM93147
(2-oxoimidazolidine-1-carboxamide, 14)
Show SMILES CC(=O)Nc1cc(Oc2ccc(NC(=O)N3CCN(C3=O)c3ccc(F)cc3)cc2)ccn1
Show InChI InChI=1S/C23H20FN5O4/c1-15(30)26-21-14-20(10-11-25-21)33-19-8-4-17(5-9-19)27-22(31)29-13-12-28(23(29)32)18-6-2-16(24)3-7-18/h2-11,14H,12-13H2,1H3,(H,27,31)(H,25,26,30)
n/an/a 3n/an/an/an/an/an/a
MethylGene Inc.
Assay Description
Inhibition assay using kinase inhibitors.
International Journal of Medicinal Chemistry 2012: 1-6 (2012)
BindingDB Entry DOI: 10.7270/Q2X065P9