BDBM933 5PhBuCOOH deriv.::Statine deriv. 13::Tle-Val-Sta::benzyl N-[(1S)-1-{[(2S,3R,4R)-4-{[(1S)-1-(benzylcarbamoyl)-2-methylpropyl]carbamoyl}-3-hydroxy-1-phenyl-4-[(4-phenylphenyl)amino]butan-2-yl]carbamoyl}-2-methylpropyl]carbamate
SMILES: CC(C)[C@H](NC(=O)OCc1ccccc1)C(=O)N[C@@H](Cc1ccccc1)[C@@H](O)[C@@H](Nc1ccc(cc1)-c1ccccc1)C(=O)N[C@@H](C(C)C)C(=O)NCc1ccccc1
InChI Key: InChIKey=HMSKCZXYEIDCLU-LVINFGBXSA-N
Data: 2 KI
Activity Spreadsheet -- Enzyme Inhibition Constant Data from BindingDB
Found 2 hits for monomerid = 933
Trg + Lig
Ki
nM
ΔG°
kcal/mole
IC50
nM
Kd
nM
EC50/IC50
nM
koff
s-1
kon
M-1s-1
pHTemp
°C
Human immunodeficiency virus type 1 protease
(Human immunodeficiency virus type 1)
BDBM933
(5PhBuCOOH deriv. | Statine deriv. 13 | Tle-Val-Sta...)
Show SMILES CC(C)[C@H](NC(=O)OCc1ccccc1)C(=O)N[C@@H](Cc1ccccc1)[C@@H](O)[C@@H](Nc1ccc(cc1)-c1ccccc1)C(=O)N[C@@H](C(C)C)C(=O)NCc1ccccc1 |r|
Show InChI InChI=1S/C48H55N5O6/c1-32(2)41(45(55)49-30-35-19-11-6-12-20-35)52-47(57)43(50-39-27-25-38(26-28-39)37-23-15-8-16-24-37)44(54)40(29-34-17-9-5-10-18-34)51-46(56)42(33(3)4)53-48(58)59-31-36-21-13-7-14-22-36/h5-28,32-33,40-44,50,54H,29-31H2,1-4H3,(H,49,55)(H,51,56)(H,52,57)(H,53,58)/t40-,41-,42-,43+,44+/m0/s1
58.9n/an/an/an/an/an/an/an/a
SANDOZ Forschungsinstitut Ges. m.b.H
Curated by ChEMBL
Assay Description
Inhibitory activity was determined against HIV type 1 protease
J Med Chem 38: 4917-28 (1996)
BindingDB Entry DOI: 10.7270/Q2FX7BN8
HIV-1 Protease
(Human immunodeficiency virus type 1)
BDBM933
(5PhBuCOOH deriv. | Statine deriv. 13 | Tle-Val-Sta...)
Show SMILES CC(C)[C@H](NC(=O)OCc1ccccc1)C(=O)N[C@@H](Cc1ccccc1)[C@@H](O)[C@@H](Nc1ccc(cc1)-c1ccccc1)C(=O)N[C@@H](C(C)C)C(=O)NCc1ccccc1 |r|
Show InChI InChI=1S/C48H55N5O6/c1-32(2)41(45(55)49-30-35-19-11-6-12-20-35)52-47(57)43(50-39-27-25-38(26-28-39)37-23-15-8-16-24-37)44(54)40(29-34-17-9-5-10-18-34)51-46(56)42(33(3)4)53-48(58)59-31-36-21-13-7-14-22-36/h5-28,32-33,40-44,50,54H,29-31H2,1-4H3,(H,49,55)(H,51,56)(H,52,57)(H,53,58)/t40-,41-,42-,43+,44+/m0/s1
59 -10.3n/an/an/an/an/a6.2537
SANDOZ Forschungsinstitut Ges.m.b.H.
Assay Description
Enzymatic activity was measured by following cleavage of the substrate H-Lys-Ala-Arg-Val-Leu-pNph-Glu-Ala-Nle-NH2. Products of the cleavage reaction ...
J Med Chem 37: 3079-89 (1994)
Article DOI: 10.1021/jm00045a013
BindingDB Entry DOI: 10.7270/Q21J97XV