BDBM93301 Oxamic Acid/Ester, 19
SMILES: OC(=O)C(=O)N1CCN(Cc2ccccc2)CC1
InChI Key: InChIKey=ZVYOXQMGCBAZLR-UHFFFAOYSA-N
Data: 2 IC50
Activity Spreadsheet -- Enzyme Inhibition Constant Data from BindingDB
Found 2 hits for monomerid = 93301
Trg + Lig
Ki
nM
ΔG°
kcal/mole
IC50
nM
Kd
nM
EC50/IC50
nM
koff
s-1
kon
M-1s-1
pHTemp
°C
Lactate dehydrogenase (LDH)
(Bos taurus (Bovine))
BDBM93301
(Oxamic Acid/Ester, 19)
Show SMILES OC(=O)C(=O)N1CCN(Cc2ccccc2)CC1
Show InChI InChI=1S/C13H16N2O3/c16-12(13(17)18)15-8-6-14(7-9-15)10-11-4-2-1-3-5-11/h1-5H,6-10H2,(H,17,18)
n/an/a 4.60E+4n/an/an/an/an/an/a
University of Mississippi
Assay Description
Enzyme assay using recombinant pfLDH and mLDH (bovine heart).
J Comb Chem 9: 292-300 (2007)
Article DOI: 10.1021/cc060110n
BindingDB Entry DOI: 10.7270/Q23J3BKZ
Lactate dehydrogenase (LDH)
(Plasmodium falciparum)
BDBM93301
(Oxamic Acid/Ester, 19)
Show SMILES OC(=O)C(=O)N1CCN(Cc2ccccc2)CC1
Show InChI InChI=1S/C13H16N2O3/c16-12(13(17)18)15-8-6-14(7-9-15)10-11-4-2-1-3-5-11/h1-5H,6-10H2,(H,17,18)
n/an/a 1.69E+5n/an/an/an/an/an/a
University of Mississippi
Assay Description
Enzyme assay using recombinant pfLDH and mLDH (bovine heart).
J Comb Chem 9: 292-300 (2007)
Article DOI: 10.1021/cc060110n
BindingDB Entry DOI: 10.7270/Q23J3BKZ