BDBM93315 Oxamic Acid/Ester, 33
SMILES: CC1CCCCN1C(=O)C(O)=O
InChI Key: InChIKey=DUGBUYIJTAXGAQ-UHFFFAOYSA-N
Data: 2 IC50
Activity Spreadsheet -- Enzyme Inhibition Constant Data from BindingDB
Found 2 hits for monomerid = 93315
Trg + Lig
Ki
nM
ΔG°
kcal/mole
IC50
nM
Kd
nM
EC50/IC50
nM
koff
s-1
kon
M-1s-1
pHTemp
°C
Lactate dehydrogenase (LDH)
(Bos taurus (Bovine))
BDBM93315
(Oxamic Acid/Ester, 33)
Show SMILES CC1CCCCN1C(=O)C(O)=O
Show InChI InChI=1S/C8H13NO3/c1-6-4-2-3-5-9(6)7(10)8(11)12/h6H,2-5H2,1H3,(H,11,12)
n/an/a 4.30E+4n/an/an/an/an/an/a
University of Mississippi
Assay Description
Enzyme assay using recombinant pfLDH and mLDH (bovine heart).
J Comb Chem 9: 292-300 (2007)
Article DOI: 10.1021/cc060110n
BindingDB Entry DOI: 10.7270/Q23J3BKZ
Lactate dehydrogenase (LDH)
(Plasmodium falciparum)
BDBM93315
(Oxamic Acid/Ester, 33)
Show SMILES CC1CCCCN1C(=O)C(O)=O
Show InChI InChI=1S/C8H13NO3/c1-6-4-2-3-5-9(6)7(10)8(11)12/h6H,2-5H2,1H3,(H,11,12)
n/an/a>2.00E+5n/an/an/an/an/an/a
University of Mississippi
Assay Description
Enzyme assay using recombinant pfLDH and mLDH (bovine heart).
J Comb Chem 9: 292-300 (2007)
Article DOI: 10.1021/cc060110n
BindingDB Entry DOI: 10.7270/Q23J3BKZ