BDBM93462 hCB1 Inhibitor, 2{1,1,7}
SMILES: Cc1cccc(c1)-n1ncc(C(=O)NCCCc2ccccc2)c1-c1ccc(cc1)-c1ccccc1
InChI Key: InChIKey=RYSVRUNBYBQFLG-UHFFFAOYSA-N
Data: 1 IC50
Activity Spreadsheet -- Enzyme Inhibition Constant Data from BindingDB
Found 1 hit for monomerid = 93462
Trg + Lig
Ki
nM
ΔG°
kcal/mole
IC50
nM
Kd
nM
EC50/IC50
nM
koff
s-1
kon
M-1s-1
pHTemp
°C
Cannabinoid receptor 1
(Homo sapiens (Human))
BDBM93462
(hCB1 Inhibitor, 2{1,1,7})
Show SMILES Cc1cccc(c1)-n1ncc(C(=O)NCCCc2ccccc2)c1-c1ccc(cc1)-c1ccccc1
Show InChI InChI=1S/C32H29N3O/c1-24-10-8-16-29(22-24)35-31(28-19-17-27(18-20-28)26-14-6-3-7-15-26)30(23-34-35)32(36)33-21-9-13-25-11-4-2-5-12-25/h2-8,10-12,14-20,22-23H,9,13,21H2,1H3,(H,33,36)
NCI pathway
Reactome pathway
n/an/a 200n/an/an/an/an/an/a
Bristol-Myers Squibb Research and Development
Assay Description
Inhibition assay using hCB1.
ACS Comb Sci 14: 197-204 (2012)
Article DOI: 10.1021/co200147y
BindingDB Entry DOI: 10.7270/Q22J69G1