BDBM937 5PhBuCOOH deriv.::Statine deriv. 17::Tle-Val-Sta::benzyl N-[(1S)-1-{[(2S,3R,4R)-4-{[(1S)-1-(benzylcarbamoyl)-2-methylpropyl]carbamoyl}-4-{[(4-chlorophenyl)methyl]amino}-3-hydroxy-1-phenylbutan-2-yl]carbamoyl}-2-methylpropyl]carbamate
SMILES: CC(C)[C@H](NC(=O)[C@H](NCc1ccc(Cl)cc1)[C@H](O)[C@H](Cc1ccccc1)NC(=O)[C@@H](NC(=O)OCc1ccccc1)C(C)C)C(=O)NCc1ccccc1
InChI Key: InChIKey=NGDKIABSGYOZAO-NREVGYPESA-N
Data: 2 KI
Activity Spreadsheet -- Enzyme Inhibition Constant Data from BindingDB
Found 2 hits for monomerid = 937
Trg + Lig
Ki
nM
ΔG°
kcal/mole
IC50
nM
Kd
nM
EC50/IC50
nM
koff
s-1
kon
M-1s-1
pHTemp
°C
Human immunodeficiency virus type 1 protease
(Human immunodeficiency virus type 1)
BDBM937
(5PhBuCOOH deriv. | Statine deriv. 17 | Tle-Val-Sta...)
Show SMILES CC(C)[C@H](NC(=O)[C@H](NCc1ccc(Cl)cc1)[C@H](O)[C@H](Cc1ccccc1)NC(=O)[C@@H](NC(=O)OCc1ccccc1)C(C)C)C(=O)NCc1ccccc1 |r|
Show InChI InChI=1S/C43H52ClN5O6/c1-28(2)36(40(51)46-26-31-16-10-6-11-17-31)48-42(53)38(45-25-32-20-22-34(44)23-21-32)39(50)35(24-30-14-8-5-9-15-30)47-41(52)37(29(3)4)49-43(54)55-27-33-18-12-7-13-19-33/h5-23,28-29,35-39,45,50H,24-27H2,1-4H3,(H,46,51)(H,47,52)(H,48,53)(H,49,54)/t35-,36-,37-,38+,39+/m0/s1
17n/an/an/an/an/an/an/an/a
SANDOZ Forschungsinstitut Ges. m.b.H
Curated by ChEMBL
Assay Description
Inhibitory activity was determined against HIV type 1 protease
J Med Chem 38: 4917-28 (1996)
BindingDB Entry DOI: 10.7270/Q2FX7BN8
HIV-1 Protease
(Human immunodeficiency virus type 1)
BDBM937
(5PhBuCOOH deriv. | Statine deriv. 17 | Tle-Val-Sta...)
Show SMILES CC(C)[C@H](NC(=O)[C@H](NCc1ccc(Cl)cc1)[C@H](O)[C@H](Cc1ccccc1)NC(=O)[C@@H](NC(=O)OCc1ccccc1)C(C)C)C(=O)NCc1ccccc1 |r|
Show InChI InChI=1S/C43H52ClN5O6/c1-28(2)36(40(51)46-26-31-16-10-6-11-17-31)48-42(53)38(45-25-32-20-22-34(44)23-21-32)39(50)35(24-30-14-8-5-9-15-30)47-41(52)37(29(3)4)49-43(54)55-27-33-18-12-7-13-19-33/h5-23,28-29,35-39,45,50H,24-27H2,1-4H3,(H,46,51)(H,47,52)(H,48,53)(H,49,54)/t35-,36-,37-,38+,39+/m0/s1
17 -11.0n/an/an/an/an/a6.2537
SANDOZ Forschungsinstitut Ges.m.b.H.
Assay Description
Enzymatic activity was measured by following cleavage of the substrate H-Lys-Ala-Arg-Val-Leu-pNph-Glu-Ala-Nle-NH2. Products of the cleavage reaction ...
J Med Chem 37: 3079-89 (1994)
Article DOI: 10.1021/jm00045a013
BindingDB Entry DOI: 10.7270/Q21J97XV