BDBM93993 4-[(4-bromo-2,5-dimethyl-pyrazole-3-carbonyl)thiocarbamoylamino]benzoic acid butyl ester::4-[[[[(4-bromo-2,5-dimethyl-3-pyrazolyl)-oxomethyl]amino]-sulfanylidenemethyl]amino]benzoic acid butyl ester::MLS000698217::SMR000227922::butyl 4-[(4-bromanyl-2,5-dimethyl-pyrazol-3-yl)carbonylcarbamothioylamino]benzoate::butyl 4-[(4-bromo-2,5-dimethylpyrazole-3-carbonyl)carbamothioylamino]benzoate::butyl 4-[({[(4-bromo-1,3-dimethyl-1H-pyrazol-5-yl)carbonyl]amino}carbothioyl)amino]benzoate::cid_1764318
SMILES: CCCCOC(=O)c1ccc(NC(=S)NC(=O)c2c(Br)c(C)nn2C)cc1
InChI Key: InChIKey=SRWWECBCRCDCRW-UHFFFAOYSA-N
Data: 1 IC50
Activity Spreadsheet -- Enzyme Inhibition Constant Data from BindingDB
Found 1 hit for monomerid = 93993
Trg + Lig
Ki
nM
ΔG°
kcal/mole
IC50
nM
Kd
nM
EC50/IC50
nM
koff
s-1
kon
M-1s-1
pHTemp
°C
Endothelial PAS domain-containing protein 1
(Homo sapiens (Human))
BDBM93993
(4-[(4-bromo-2,5-dimethyl-pyrazole-3-carbonyl)thioc...)
Show SMILES CCCCOC(=O)c1ccc(NC(=S)NC(=O)c2c(Br)c(C)nn2C)cc1
Show InChI InChI=1S/C18H21BrN4O3S/c1-4-5-10-26-17(25)12-6-8-13(9-7-12)20-18(27)21-16(24)15-14(19)11(2)22-23(15)3/h6-9H,4-5,10H2,1-3H3,(H2,20,21,24,27)
Reactome pathway
PCBioAssay
n/an/a 894n/an/an/an/an/an/a
Burnham Center for Chemical Genomics
Curated by PubChem BioAssay
PubChem Bioassay (2012)
BindingDB Entry DOI: 10.7270/Q2WS8RVZ