BDBM94508 2-[3-(2-furanyl)-2-oxo-1-quinoxalinyl]-2-(4-methoxyphenyl)-N-pentylacetamide::2-[3-(furan-2-yl)-2-oxidanylidene-quinoxalin-1-yl]-2-(4-methoxyphenyl)-N-pentyl-ethanamide::2-[3-(furan-2-yl)-2-oxoquinoxalin-1-yl]-2-(4-methoxyphenyl)-N-pentylacetamide::MLS003674166::N-amyl-2-[3-(2-furyl)-2-keto-quinoxalin-1-yl]-2-(4-methoxyphenyl)acetamide::SMR002353634::cid_53383148
SMILES: CCCCCNC(=O)C(c1ccc(OC)cc1)n1c2ccccc2nc(-c2ccco2)c1=O
InChI Key: InChIKey=BPYAUTJOWXOIBG-UHFFFAOYSA-N
Data: 3 IC50
Activity Spreadsheet -- Enzyme Inhibition Constant Data from BindingDB
Found 3 hits for monomerid = 94508
Trg + Lig
Ki
nM
ΔG°
kcal/mole
IC50
nM
Kd
nM
EC50/IC50
nM
koff
s-1
kon
M-1s-1
pHTemp
°C
Hepatocyte nuclear factor 4-alpha
(Homo sapiens (Human))
BDBM94508
(2-[3-(2-furanyl)-2-oxo-1-quinoxalinyl]-2-(4-methox...)
Show SMILES CCCCCNC(=O)C(c1ccc(OC)cc1)n1c2ccccc2nc(-c2ccco2)c1=O
Show InChI InChI=1S/C26H27N3O4/c1-3-4-7-16-27-25(30)24(18-12-14-19(32-2)15-13-18)29-21-10-6-5-9-20(21)28-23(26(29)31)22-11-8-17-33-22/h5-6,8-15,17,24H,3-4,7,16H2,1-2H3,(H,27,30)
NCI pathway
Reactome pathway
PCBioAssay
n/an/a 3.07E+3n/an/an/an/an/an/a
The Scripps Research Institute Molecular Screening Center
Curated by PubChem BioAssay
PubChem Bioassay (2012)
BindingDB Entry DOI: 10.7270/Q2736PH3
perilipin-5
(Homo sapiens (Human))
BDBM94508
(2-[3-(2-furanyl)-2-oxo-1-quinoxalinyl]-2-(4-methox...)
Show SMILES CCCCCNC(=O)C(c1ccc(OC)cc1)n1c2ccccc2nc(-c2ccco2)c1=O
Show InChI InChI=1S/C26H27N3O4/c1-3-4-7-16-27-25(30)24(18-12-14-19(32-2)15-13-18)29-21-10-6-5-9-20(21)28-23(26(29)31)22-11-8-17-33-22/h5-6,8-15,17,24H,3-4,7,16H2,1-2H3,(H,27,30)
PCBioAssay
n/an/a 2.18E+3n/an/an/an/an/an/a
The Scripps Research Institute Molecular Screening Center
Curated by PubChem BioAssay
PubChem Bioassay (2012)
BindingDB Entry DOI: 10.7270/Q24B2ZW9
perilipin-1
(Homo sapiens (Human))
BDBM94508
(2-[3-(2-furanyl)-2-oxo-1-quinoxalinyl]-2-(4-methox...)
Show SMILES CCCCCNC(=O)C(c1ccc(OC)cc1)n1c2ccccc2nc(-c2ccco2)c1=O
Show InChI InChI=1S/C26H27N3O4/c1-3-4-7-16-27-25(30)24(18-12-14-19(32-2)15-13-18)29-21-10-6-5-9-20(21)28-23(26(29)31)22-11-8-17-33-22/h5-6,8-15,17,24H,3-4,7,16H2,1-2H3,(H,27,30)
Reactome pathway
PCBioAssay
n/an/a 1.41E+3n/an/an/an/an/an/a
The Scripps Research Institute Molecular Screening Center
Curated by PubChem BioAssay
PubChem Bioassay (2012)
BindingDB Entry DOI: 10.7270/Q2CV4GBF