BDBM94562 MLS003674192::N-(2,6-dimethylphenyl)-2-[3-(2-furanyl)-2-oxo-1-quinoxalinyl]-2-(4-methoxyphenyl)acetamide::N-(2,6-dimethylphenyl)-2-[3-(2-furyl)-2-keto-quinoxalin-1-yl]-2-(4-methoxyphenyl)acetamide::N-(2,6-dimethylphenyl)-2-[3-(furan-2-yl)-2-oxidanylidene-quinoxalin-1-yl]-2-(4-methoxyphenyl)ethanamide::N-(2,6-dimethylphenyl)-2-[3-(furan-2-yl)-2-oxoquinoxalin-1-yl]-2-(4-methoxyphenyl)acetamide::SMR002353660::cid_53383172
SMILES: COc1ccc(cc1)C(C(=O)Nc1c(C)cccc1C)n1c2ccccc2nc(-c2ccco2)c1=O
InChI Key: InChIKey=SEOLOZOFOHMNKW-UHFFFAOYSA-N
Data: 3 IC50
Activity Spreadsheet -- Enzyme Inhibition Constant Data from BindingDB
Found 3 hits for monomerid = 94562
Trg + Lig
Ki
nM
ΔG°
kcal/mole
IC50
nM
Kd
nM
EC50/IC50
nM
koff
s-1
kon
M-1s-1
pHTemp
°C
Hepatocyte nuclear factor 4-alpha
(Homo sapiens (Human))
BDBM94562
(MLS003674192 | N-(2,6-dimethylphenyl)-2-[3-(2-fura...)
Show SMILES COc1ccc(cc1)C(C(=O)Nc1c(C)cccc1C)n1c2ccccc2nc(-c2ccco2)c1=O
Show InChI InChI=1S/C29H25N3O4/c1-18-8-6-9-19(2)25(18)31-28(33)27(20-13-15-21(35-3)16-14-20)32-23-11-5-4-10-22(23)30-26(29(32)34)24-12-7-17-36-24/h4-17,27H,1-3H3,(H,31,33)
NCI pathway
Reactome pathway
PCBioAssay
n/an/a 2.42E+3n/an/an/an/an/an/a
The Scripps Research Institute Molecular Screening Center
Curated by PubChem BioAssay
PubChem Bioassay (2012)
BindingDB Entry DOI: 10.7270/Q2736PH3
Perilipin-5
(Homo sapiens (Human))
BDBM94562
(MLS003674192 | N-(2,6-dimethylphenyl)-2-[3-(2-fura...)
Show SMILES COc1ccc(cc1)C(C(=O)Nc1c(C)cccc1C)n1c2ccccc2nc(-c2ccco2)c1=O
Show InChI InChI=1S/C29H25N3O4/c1-18-8-6-9-19(2)25(18)31-28(33)27(20-13-15-21(35-3)16-14-20)32-23-11-5-4-10-22(23)30-26(29(32)34)24-12-7-17-36-24/h4-17,27H,1-3H3,(H,31,33)
PCBioAssay
n/an/a 2.38E+3n/an/an/an/an/an/a
The Scripps Research Institute Molecular Screening Center
Curated by PubChem BioAssay
PubChem Bioassay (2012)
BindingDB Entry DOI: 10.7270/Q24B2ZW9
Perilipin-1
(Homo sapiens (Human))
BDBM94562
(MLS003674192 | N-(2,6-dimethylphenyl)-2-[3-(2-fura...)
Show SMILES COc1ccc(cc1)C(C(=O)Nc1c(C)cccc1C)n1c2ccccc2nc(-c2ccco2)c1=O
Show InChI InChI=1S/C29H25N3O4/c1-18-8-6-9-19(2)25(18)31-28(33)27(20-13-15-21(35-3)16-14-20)32-23-11-5-4-10-22(23)30-26(29(32)34)24-12-7-17-36-24/h4-17,27H,1-3H3,(H,31,33)
Reactome pathway
PCBioAssay
n/an/a 1.88E+3n/an/an/an/an/an/a
The Scripps Research Institute Molecular Screening Center
Curated by PubChem BioAssay
PubChem Bioassay (2012)
BindingDB Entry DOI: 10.7270/Q2CV4GBF