BDBM952 5PhBuCOOH deriv.::Statine deriv. 32::Tle-Val-Sta::benzyl N-[(1S)-1-{[(2S,3R,4R)-4-(benzylamino)-4-{[(1S)-1-(benzylcarbamoyl)-2,2-dimethylpropyl]carbamoyl}-3-hydroxy-1-phenylbutan-2-yl]carbamoyl}-2-methylpropyl]carbamate
SMILES: CC(C)[C@H](NC(=O)OCc1ccccc1)C(=O)N[C@@H](Cc1ccccc1)[C@@H](O)[C@@H](NCc1ccccc1)C(=O)N[C@H](C(=O)NCc1ccccc1)C(C)(C)C
InChI Key: InChIKey=JFBBYPUUHAEXCA-VEJIKZNJSA-N
Data: 2 KI
Activity Spreadsheet -- Enzyme Inhibition Constant Data from BindingDB
Found 2 hits for monomerid = 952
Trg + Lig
Ki
nM
ΔG°
kcal/mole
IC50
nM
Kd
nM
EC50/IC50
nM
koff
s-1
kon
M-1s-1
pHTemp
°C
Human immunodeficiency virus type 1 protease
(Human immunodeficiency virus type 1)
BDBM952
(5PhBuCOOH deriv. | Statine deriv. 32 | Tle-Val-Sta...)
Show SMILES CC(C)[C@H](NC(=O)OCc1ccccc1)C(=O)N[C@@H](Cc1ccccc1)[C@@H](O)[C@@H](NCc1ccccc1)C(=O)N[C@H](C(=O)NCc1ccccc1)C(C)(C)C |r|
Show InChI InChI=1S/C44H55N5O6/c1-30(2)36(48-43(54)55-29-34-24-16-9-17-25-34)40(51)47-35(26-31-18-10-6-11-19-31)38(50)37(45-27-32-20-12-7-13-21-32)41(52)49-39(44(3,4)5)42(53)46-28-33-22-14-8-15-23-33/h6-25,30,35-39,45,50H,26-29H2,1-5H3,(H,46,53)(H,47,51)(H,48,54)(H,49,52)/t35-,36-,37+,38+,39+/m0/s1
20n/an/an/an/an/an/an/an/a
SANDOZ Forschungsinstitut Ges. m.b.H
Curated by ChEMBL
Assay Description
Inhibitory activity was determined against HIV type 1 protease
J Med Chem 38: 4917-28 (1996)
BindingDB Entry DOI: 10.7270/Q2FX7BN8
HIV-1 Protease
(Human immunodeficiency virus type 1)
BDBM952
(5PhBuCOOH deriv. | Statine deriv. 32 | Tle-Val-Sta...)
Show SMILES CC(C)[C@H](NC(=O)OCc1ccccc1)C(=O)N[C@@H](Cc1ccccc1)[C@@H](O)[C@@H](NCc1ccccc1)C(=O)N[C@H](C(=O)NCc1ccccc1)C(C)(C)C |r|
Show InChI InChI=1S/C44H55N5O6/c1-30(2)36(48-43(54)55-29-34-24-16-9-17-25-34)40(51)47-35(26-31-18-10-6-11-19-31)38(50)37(45-27-32-20-12-7-13-21-32)41(52)49-39(44(3,4)5)42(53)46-28-33-22-14-8-15-23-33/h6-25,30,35-39,45,50H,26-29H2,1-5H3,(H,46,53)(H,47,51)(H,48,54)(H,49,52)/t35-,36-,37+,38+,39+/m0/s1
20 -10.9n/an/an/an/an/a6.2537
SANDOZ Forschungsinstitut Ges.m.b.H.
Assay Description
Enzymatic activity was measured by following cleavage of the substrate H-Lys-Ala-Arg-Val-Leu-pNph-Glu-Ala-Nle-NH2. Products of the cleavage reaction ...
J Med Chem 37: 3079-89 (1994)
Article DOI: 10.1021/jm00045a013
BindingDB Entry DOI: 10.7270/Q21J97XV