BDBM95264 2-[2-[(4-methylphenyl)carbamothioylamino]-1,3-thiazol-4-yl]-N-phenyl-ethanamide::2-[2-[(4-methylphenyl)carbamothioylamino]-1,3-thiazol-4-yl]-N-phenylacetamide::2-[2-[[(4-methylanilino)-sulfanylidenemethyl]amino]-4-thiazolyl]-N-phenylacetamide::MLS000549795::N-Phenyl-2-[2-(3-p-tolyl-thioureido)-thiazol-4-yl]-acetamide::N-phenyl-2-[2-(p-tolylthiocarbamoylamino)thiazol-4-yl]acetamide::SMR000172543::cid_1169033
SMILES: Cc1ccc(NC(=S)Nc2nc(CC(=O)Nc3ccccc3)cs2)cc1
InChI Key: InChIKey=LVJXAASFBSYIIX-UHFFFAOYSA-N
Data: 3 IC50
Activity Spreadsheet -- Enzyme Inhibition Constant Data from BindingDB
Found 3 hits for monomerid = 95264
Trg + Lig
Ki
nM
ΔG°
kcal/mole
IC50
nM
Kd
nM
EC50/IC50
nM
koff
s-1
kon
M-1s-1
pHTemp
°C
Envelope glycoprotein gp160
(Human immunodeficiency virus type 1 group M subtyp...)
BDBM95264
(2-[2-[(4-methylphenyl)carbamothioylamino]-1,3-thia...)
Show SMILES Cc1ccc(NC(=S)Nc2nc(CC(=O)Nc3ccccc3)cs2)cc1
Show InChI InChI=1S/C19H18N4OS2/c1-13-7-9-15(10-8-13)21-18(25)23-19-22-16(12-26-19)11-17(24)20-14-5-3-2-4-6-14/h2-10,12H,11H2,1H3,(H,20,24)(H2,21,22,23,25)
PCBioAssay
n/an/a>6.70E+4n/an/an/an/an/an/a
The Scripps Research Institute Molecular Screening Center
Curated by PubChem BioAssay
PubChem Bioassay (2012)
BindingDB Entry DOI: 10.7270/Q2KD1WJB
Envelope glycoprotein gp160
(Human immunodeficiency virus type 1 group M subtyp...)
BDBM95264
(2-[2-[(4-methylphenyl)carbamothioylamino]-1,3-thia...)
Show SMILES Cc1ccc(NC(=S)Nc2nc(CC(=O)Nc3ccccc3)cs2)cc1
Show InChI InChI=1S/C19H18N4OS2/c1-13-7-9-15(10-8-13)21-18(25)23-19-22-16(12-26-19)11-17(24)20-14-5-3-2-4-6-14/h2-10,12H,11H2,1H3,(H,20,24)(H2,21,22,23,25)
PCBioAssay
n/an/a 2.61E+4n/an/an/an/an/an/a
The Scripps Research Institute Molecular Screening Center
Curated by PubChem BioAssay
PubChem Bioassay (2012)
BindingDB Entry DOI: 10.7270/Q29W0D3P
Envelope glycoprotein gp160
(Human immunodeficiency virus type 1 group M subtyp...)
BDBM95264
(2-[2-[(4-methylphenyl)carbamothioylamino]-1,3-thia...)
Show SMILES Cc1ccc(NC(=S)Nc2nc(CC(=O)Nc3ccccc3)cs2)cc1
Show InChI InChI=1S/C19H18N4OS2/c1-13-7-9-15(10-8-13)21-18(25)23-19-22-16(12-26-19)11-17(24)20-14-5-3-2-4-6-14/h2-10,12H,11H2,1H3,(H,20,24)(H2,21,22,23,25)
PCBioAssay
n/an/a 3.23E+4n/an/an/an/an/an/a
The Scripps Research Institute Molecular Screening Center
Curated by PubChem BioAssay
PubChem Bioassay (2012)
BindingDB Entry DOI: 10.7270/Q2FN14T0