BDBM95426 2-(2-keto-8-methyl-4-phenyl-chromen-7-yl)oxy-N,N-dimethyl-acetamide::MLS001173230::N,N-dimethyl-2-(8-methyl-2-oxidanylidene-4-phenyl-chromen-7-yl)oxy-ethanamide::N,N-dimethyl-2-(8-methyl-2-oxo-4-phenylchromen-7-yl)oxyacetamide::N,N-dimethyl-2-[(8-methyl-2-oxo-4-phenyl-1-benzopyran-7-yl)oxy]acetamide::SMR000539067::cid_701655
SMILES: CN(C)C(=O)COc1ccc2c(cc(=O)oc2c1C)-c1ccccc1
InChI Key: InChIKey=DHFLAKZHMNAILN-UHFFFAOYSA-N
Data: 1 IC50
Activity Spreadsheet -- Enzyme Inhibition Constant Data from BindingDB
Found 1 hit for monomerid = 95426
Trg + Lig
Ki
nM
ΔG°
kcal/mole
IC50
nM
Kd
nM
EC50/IC50
nM
koff
s-1
kon
M-1s-1
pHTemp
°C
MSRA protein
(Bos taurus)
BDBM95426
(2-(2-keto-8-methyl-4-phenyl-chromen-7-yl)oxy-N,N-d...)
Show SMILES CN(C)C(=O)COc1ccc2c(cc(=O)oc2c1C)-c1ccccc1
Show InChI InChI=1S/C20H19NO4/c1-13-17(24-12-18(22)21(2)3)10-9-15-16(11-19(23)25-20(13)15)14-7-5-4-6-8-14/h4-11H,12H2,1-3H3
PCBioAssay
n/an/a 9.36E+4n/an/an/an/an/an/a
The Scripps Research Institute Molecular Screening Center
Curated by PubChem BioAssay
PubChem Bioassay (2013)
BindingDB Entry DOI: 10.7270/Q2639NCQ