BDBM95488 (5Z)-5-[4-[(4-methyl-2-oxido-furazan-2-ium-3-yl)methoxy]benzylidene]-2-thioxo-4-imidazolidinone::(5Z)-5-[[4-[(4-methyl-2-oxidanidyl-1,2,5-oxadiazol-2-ium-3-yl)methoxy]phenyl]methylidene]-2-sulfanylidene-imidazolidin-4-one::(5Z)-5-[[4-[(4-methyl-2-oxido-1,2,5-oxadiazol-2-ium-3-yl)methoxy]phenyl]methylidene]-2-sulfanylidene-4-imidazolidinone::(5Z)-5-[[4-[(4-methyl-2-oxido-1,2,5-oxadiazol-2-ium-3-yl)methoxy]phenyl]methylidene]-2-sulfanylideneimidazolidin-4-one::5-{4-[(4-methyl-2-oxido-1,2,5-oxadiazol-3-yl)methoxy]benzylidene}-2-thioxo-4-imidazolidinone::MLS000533710::SMR000141148::cid_5346844
SMILES: Cc1n[o+]n([O-])c1COc1ccc(\C=C2/NC(=S)NC2=O)cc1
InChI Key: InChIKey=HTSPVMAXDHUKNN-WDZFZDKYSA-N
Data: 2 IC50
Activity Spreadsheet -- Enzyme Inhibition Constant Data from BindingDB
Found 2 hits for monomerid = 95488
Trg + Lig
Ki
nM
ΔG°
kcal/mole
IC50
nM
Kd
nM
EC50/IC50
nM
koff
s-1
kon
M-1s-1
pHTemp
°C
Alpha trans-inducing protein (VP16)
(Human herpesvirus 1 (strain 17) (HHV-1) (Human her...)
BDBM95488
((5Z)-5-[4-[(4-methyl-2-oxido-furazan-2-ium-3-yl)me...)
Show SMILES Cc1n[o+]n([O-])c1COc1ccc(\C=C2/NC(=S)NC2=O)cc1
Show InChI InChI=1S/C14H12N4O4S/c1-8-12(18(20)22-17-8)7-21-10-4-2-9(3-5-10)6-11-13(19)16-14(23)15-11/h2-6H,7H2,1H3,(H2,15,16,19,23)/b11-6-
PCBioAssay
n/an/a>3.59E+4n/an/an/an/an/an/a
The Scripps Research Institute Molecular Screening Center
Curated by PubChem BioAssay
PubChem Bioassay (2013)
BindingDB Entry DOI: 10.7270/Q2SX6BVP
nuclear receptor subfamily 5 group A member 2 isoform 2
(Homo sapiens (Human))
BDBM95488
((5Z)-5-[4-[(4-methyl-2-oxido-furazan-2-ium-3-yl)me...)
Show SMILES Cc1n[o+]n([O-])c1COc1ccc(\C=C2/NC(=S)NC2=O)cc1
Show InChI InChI=1S/C14H12N4O4S/c1-8-12(18(20)22-17-8)7-21-10-4-2-9(3-5-10)6-11-13(19)16-14(23)15-11/h2-6H,7H2,1H3,(H2,15,16,19,23)/b11-6-
Reactome pathway
PCBioAssay
n/an/a 578n/an/an/an/an/an/a
The Scripps Research Institute Molecular Screening Center
Curated by PubChem BioAssay
PubChem Bioassay (2013)
BindingDB Entry DOI: 10.7270/Q22F7M18