BDBM95739 MLS000679757::N-(3-chloranyl-4-fluoranyl-phenyl)-4-oxidanylidene-3,10-dihydro-2H-pyrimido[1,2-a]benzimidazole-2-carboxamide::N-(3-chloro-4-fluoro-phenyl)-4-keto-3,10-dihydro-2H-pyrimido[1,2-a]benzimidazole-2-carboxamide::N-(3-chloro-4-fluorophenyl)-4-oxo-1,2,3,4-tetrahydropyrimido[1,2-a]benzimidazole-2-carboxamide::N-(3-chloro-4-fluorophenyl)-4-oxo-3,10-dihydro-2H-pyrimido[1,2-a]benzimidazole-2-carboxamide::SMR000296598::cid_5741663
SMILES: Fc1ccc(NC(=O)C2CC(=O)n3c(N2)nc2ccccc32)cc1Cl
InChI Key: InChIKey=OBYPUEIMKJGELF-UHFFFAOYSA-N
Data: 1 IC50
Activity Spreadsheet -- Enzyme Inhibition Constant Data from BindingDB
Found 1 hit for monomerid = 95739
Trg + Lig
Ki
nM
ΔG°
kcal/mole
IC50
nM
Kd
nM
EC50/IC50
nM
koff
s-1
kon
M-1s-1
pHTemp
°C
methionyl-tRNA synthetase
(Trypanosoma brucei brucei strain 927/4 GUTat10.1)
BDBM95739
(MLS000679757 | N-(3-chloranyl-4-fluoranyl-phenyl)-...)
Show SMILES Fc1ccc(NC(=O)C2CC(=O)n3c(N2)nc2ccccc32)cc1Cl
Show InChI InChI=1S/C17H12ClFN4O2/c18-10-7-9(5-6-11(10)19)20-16(25)13-8-15(24)23-14-4-2-1-3-12(14)21-17(23)22-13/h1-7,13H,8H2,(H,20,25)(H,21,22)
PCBioAssay
n/an/a 1.47E+3n/an/an/an/an/an/a
The Scripps Research Institute Molecular Screening Center
Curated by PubChem BioAssay
PubChem Bioassay (2013)
BindingDB Entry DOI: 10.7270/Q2XP73JZ