null
SMILES: OCc1ccc(CO[C@@H]2C[C@@H](C=C(O2)C(=O)NCc2nc3ccccc3[nH]2)c2ccccc2)cc1
InChI Key: InChIKey=HQGKRIBASAVMED-AMGIVPHBSA-N
Activity Spreadsheet -- Enzyme Inhibition Constant Data from BindingDB
Found 1 hit for monomerid = 95764
Trg + Lig
Ki
nM
ΔG°
kcal/mole
IC50
nM
Kd
nM
EC50/IC50
nM
koff
s-1
kon
M-1s-1
pHTemp
°C
Methionine--tRNA ligase
(Trypanosoma brucei brucei strain 927/4 GUTat10.1)
BDBM95764
((2S,4S)-N-(1H-benzimidazol-2-ylmethyl)-2-(4-methyl...)
Show SMILES OCc1ccc(CO[C@@H]2C[C@@H](C=C(O2)C(=O)NCc2nc3ccccc3[nH]2)c2ccccc2)cc1 |c:11|
Show InChI InChI=1S/C28H27N3O4/c32-17-19-10-12-20(13-11-19)18-34-27-15-22(21-6-2-1-3-7-21)14-25(35-27)28(33)29-16-26-30-23-8-4-5-9-24(23)31-26/h1-14,22,27,32H,15-18H2,(H,29,33)(H,30,31)/t22-,27+/m1/s1
PCBioAssay
n/an/a 835n/an/an/an/an/an/a
The Scripps Research Institute Molecular Screening Center
Curated by PubChem BioAssay
PubChem Bioassay (2013)
BindingDB Entry DOI: 10.7270/Q2XP73JZ