null
SMILES: Oc1c(Cl)cc(Cl)cc1CNc1nc2ccccc2[nH]1
InChI Key: InChIKey=PHXOGHJCYJBTPQ-UHFFFAOYSA-N
Activity Spreadsheet -- Enzyme Inhibition Constant Data from BindingDB
Found 1 hit for monomerid = 95793
Trg + Lig
Ki
nM
ΔG°
kcal/mole
IC50
nM
Kd
nM
EC50/IC50
nM
koff
s-1
kon
M-1s-1
pHTemp
°C
Methionine--tRNA ligase
(Trypanosoma brucei brucei strain 927/4 GUTat10.1)
BDBM95793
(2-[(1H-Benzoimidazol-2-ylamino)-methyl]-4,6-dichlo...)
Show SMILES Oc1c(Cl)cc(Cl)cc1CNc1nc2ccccc2[nH]1
Show InChI InChI=1S/C14H11Cl2N3O/c15-9-5-8(13(20)10(16)6-9)7-17-14-18-11-3-1-2-4-12(11)19-14/h1-6,20H,7H2,(H2,17,18,19)
PCBioAssay
n/an/a 661n/an/an/an/an/an/a
The Scripps Research Institute Molecular Screening Center
Curated by PubChem BioAssay
PubChem Bioassay (2013)
BindingDB Entry DOI: 10.7270/Q2XP73JZ