null
SMILES: OC(=O)\C=C\c1ccc(o1)[N+]([O-])=O
InChI Key: InChIKey=LWOWNIPZHGWKNR-DUXPYHPUSA-N
Activity Spreadsheet -- Enzyme Inhibition Constant Data from BindingDB
Found 1 hit for monomerid = 96257
Trg + Lig
Ki
nM
ΔG°
kcal/mole
IC50
nM
Kd
nM
EC50/IC50
nM
koff
s-1
kon
M-1s-1
pHTemp
°C
RecBCD enzyme subunit RecD
(Escherichia coli str. K-12 substr. MG1655)
BDBM96257
((2E)-3-(5-nitro-2-furyl)acrylic acid | (E)-3-(5-ni...)
Show SMILES OC(=O)\C=C\c1ccc(o1)[N+]([O-])=O
Show InChI InChI=1S/C7H5NO5/c9-7(10)4-2-5-1-3-6(13-5)8(11)12/h1-4H,(H,9,10)/b4-2+
PCBioAssay
n/an/a 3.19E+4n/an/an/an/an/an/a
The Scripps Research Institute Molecular Screening Center
Curated by PubChem BioAssay
PubChem Bioassay (2013)
BindingDB Entry DOI: 10.7270/Q21G0JXG