null
SMILES: CCn1cc(C(=O)N[C@@H](C(C)C)C(O)=O)c(=O)c2cc3OCOc3cc12
InChI Key: InChIKey=ILNIFRXBRZEREE-HNNXBMFYSA-N
Activity Spreadsheet -- Enzyme Inhibition Constant Data from BindingDB
Found 1 hit for monomerid = 96268
Trg + Lig
Ki
nM
ΔG°
kcal/mole
IC50
nM
Kd
nM
EC50/IC50
nM
koff
s-1
kon
M-1s-1
pHTemp
°C
RecBCD enzyme subunit RecD
(Escherichia coli str. K-12 substr. MG1655)
BDBM96268
((2S)-2-[(5-ethyl-8-keto-[1,3]dioxolo[4,5-g]quinoli...)
Show SMILES CCn1cc(C(=O)N[C@@H](C(C)C)C(O)=O)c(=O)c2cc3OCOc3cc12
Show InChI InChI=1S/C18H20N2O6/c1-4-20-7-11(17(22)19-15(9(2)3)18(23)24)16(21)10-5-13-14(6-12(10)20)26-8-25-13/h5-7,9,15H,4,8H2,1-3H3,(H,19,22)(H,23,24)/t15-/m0/s1
PCBioAssay
n/an/a 4.58E+4n/an/an/an/an/an/a
The Scripps Research Institute Molecular Screening Center
Curated by PubChem BioAssay
PubChem Bioassay (2013)
BindingDB Entry DOI: 10.7270/Q21G0JXG