BDBM9641 (S)-N-(1S,2R)-[3-[2-[[(1,1-Dimethylethyl)amino]carbonyl]phenyl]-2-hydroxy-1-(phenylmethyl)-propyl]-2-[(methylsulfonyl)amino]-3-(2-naphthylsulfonyl)propanamide::D-Cysteine Analog 18c::N-tert-butyl-2-[(2R,3S)-2-hydroxy-3-[(2S)-2-methanesulfonamido-3-(naphthalene-2-sulfonyl)propanamido]-4-phenylbutyl]benzamide
SMILES: CC(C)(C)NC(=O)c1ccccc1C[C@@H](O)[C@H](Cc1ccccc1)NC(=O)[C@@H](CS(=O)(=O)c1ccc2ccccc2c1)NS(C)(=O)=O
InChI Key: InChIKey=CFEMEYSXDKRIBE-DCMFLLSESA-N
Data: 1 IC50
Activity Spreadsheet -- Enzyme Inhibition Constant Data from BindingDB
Found 1 hit for monomerid = 9641
Trg + Lig
Ki
nM
ΔG°
kcal/mole
IC50
nM
Kd
nM
EC50/IC50
nM
koff
s-1
kon
M-1s-1
pHTemp
°C
HIV-1 Protease
(Human immunodeficiency virus type 1)
BDBM9641
((S)-N-(1S,2R)-[3-[2-[[(1,1-Dimethylethyl)amino]car...)
Show SMILES CC(C)(C)NC(=O)c1ccccc1C[C@@H](O)[C@H](Cc1ccccc1)NC(=O)[C@@H](CS(=O)(=O)c1ccc2ccccc2c1)NS(C)(=O)=O |r|
Show InChI InChI=1S/C35H41N3O7S2/c1-35(2,3)37-33(40)29-17-11-10-16-27(29)22-32(39)30(20-24-12-6-5-7-13-24)36-34(41)31(38-46(4,42)43)23-47(44,45)28-19-18-25-14-8-9-15-26(25)21-28/h5-19,21,30-32,38-39H,20,22-23H2,1-4H3,(H,36,41)(H,37,40)/t30-,31+,32+/m0/s1
n/an/a 0.300n/an/an/an/an/an/a
Lilly Research Laboratories
Assay Description
The assay involves the use of a HIV-1 protease peptide substrate which has been modified to contain a biotin moiety on one side and a fluorescent rep...
J Med Chem 39: 96-108 (1996)
Article DOI: 10.1021/jm950576c
BindingDB Entry DOI: 10.7270/Q23R0R3K