BDBM96500 MLS001157845::N'-[(1E)-1-(1-cyclohexyl-2,4,6-triketo-hexahydropyrimidin-5-ylidene)ethyl]-2-hydroxy-benzohydrazide::N'-[(1E)-1-(1-cyclohexyl-2,4,6-trioxo-1,3-diazinan-5-ylidene)ethyl]-2-hydroxybenzohydrazide::N'-[(1E)-1-[1-cyclohexyl-2,4,6-tris(oxidanylidene)-1,3-diazinan-5-ylidene]ethyl]-2-oxidanyl-benzohydrazide::SMR000651281::cid_7497069
SMILES: CC(NNC(=O)c1ccccc1O)=C1C(=O)NC(=O)N(C2CCCCC2)C1=O
InChI Key: InChIKey=ACCDDXNRPHXBTM-UHFFFAOYSA-N
Data: 1 IC50
Activity Spreadsheet -- Enzyme Inhibition Constant Data from BindingDB
Found 1 hit for monomerid = 96500
Trg + Lig
Ki
nM
ΔG°
kcal/mole
IC50
nM
Kd
nM
EC50/IC50
nM
koff
s-1
kon
M-1s-1
pHTemp
°C
Homo sapiens huntingtin (HTT), mRNA
(Homo sapiens (Human))
BDBM96500
(MLS001157845 | N'-[(1E)-1-(1-cyclohexyl-2,4,6-trik...)
Show SMILES CC(NNC(=O)c1ccccc1O)=C1C(=O)NC(=O)N(C2CCCCC2)C1=O |w:1.0|
Show InChI InChI=1S/C19H22N4O5/c1-11(21-22-16(25)13-9-5-6-10-14(13)24)15-17(26)20-19(28)23(18(15)27)12-7-3-2-4-8-12/h5-6,9-10,12,21,24H,2-4,7-8H2,1H3,(H,22,25)(H,20,26,28)
PCBioAssay
n/an/a 450n/an/an/an/an/an/a
The Scripps Research Institute Molecular Screening Center
Curated by PubChem BioAssay
PubChem Bioassay (2013)
BindingDB Entry DOI: 10.7270/Q2N58K09