BDBM9682 2-methylpropyl N-[(1S)-2-[(2S,4R)-4-(tert-butylsulfanyl)-2-({1-[({[(S)-(dimethylcarbamoyl)(phenyl)methyl]carbamoyl}methyl)carbamoyl]-1-oxopentan-2-yl}carbamoyl)pyrrolidin-1-yl]-1-cyclohexyl-2-oxoethyl]carbamate::SCH446211 (SCH6) Analog 15
SMILES: CCCC(NC(=O)[C@@H]1C[C@H](CN1C(=O)[C@@H](NC(=O)OCC(C)C)C1CCCCC1)SC(C)(C)C)C(=O)C(=O)NCC(=O)N[C@H](C(=O)N(C)C)c1ccccc1
InChI Key: InChIKey=SVIUIRZMNZJQSZ-MKXWBQDCSA-N
Data: 1 KI
Activity Spreadsheet -- Enzyme Inhibition Constant Data from BindingDB
Found 1 hit for monomerid = 9682
Trg + Lig
Ki
nM
ΔG°
kcal/mole
IC50
nM
Kd
nM
EC50/IC50
nM
koff
s-1
kon
M-1s-1
pHTemp
°C
HCV NS3-NS4A Serine Proteinase
(Hepatitis C virus (HCV genotype 1a, isolate H))
BDBM9682
(2-methylpropyl N-[(1S)-2-[(2S,4R)-4-(tert-butylsul...)
Show SMILES CCCC(NC(=O)[C@@H]1C[C@H](CN1C(=O)[C@@H](NC(=O)OCC(C)C)C1CCCCC1)SC(C)(C)C)C(=O)C(=O)NCC(=O)N[C@H](C(=O)N(C)C)c1ccccc1 |r|
Show InChI InChI=1S/C40H62N6O8S/c1-9-16-29(34(48)36(50)41-22-31(47)43-32(37(51)45(7)8)26-17-12-10-13-18-26)42-35(49)30-21-28(55-40(4,5)6)23-46(30)38(52)33(27-19-14-11-15-20-27)44-39(53)54-24-25(2)3/h10,12-13,17-18,25,27-30,32-33H,9,11,14-16,19-24H2,1-8H3,(H,41,50)(H,42,49)(H,43,47)(H,44,53)/t28-,29?,30+,32+,33+/m1/s1
120 -9.59n/an/an/an/an/a6.530
Schering-Plough Research Institute
Assay Description
Proteolytic cleavage of the ester linkage between the Nva (L-norvaline) and the chromophore (PAP) was monitored for change in absorbance at 370 nm. I...
J Med Chem 49: 2750-7 (2006)
Article DOI: 10.1021/jm060077j
BindingDB Entry DOI: 10.7270/Q2V98691