BDBM9683 2-methylpropyl N-[(2S)-1-[(2S,4R)-4-(tert-butoxy)-2-({1-[({[(S)-(dimethylcarbamoyl)(phenyl)methyl]carbamoyl}methyl)carbamoyl]-1-oxopentan-2-yl}carbamoyl)pyrrolidin-1-yl]-3,3-dimethyl-1-oxobutan-2-yl]carbamate::N-[(2-Methylpropoxy)carbonyl]-(S)-tert-leucyl-N-[1-[2-[[2-[[2-(dimethylamino)-2-oxo-1(S)-phenylethyl]amino]-2-oxoethyl]amino]-1,2-dioxoethyl]butyl]-4(R)-(1,1-dimethylethoxy)-(S)-prolinamide::SCH446211 (SCH6) Analog 16
SMILES: CCCC(NC(=O)[C@@H]1C[C@H](CN1C(=O)[C@@H](NC(=O)OCC(C)C)C(C)(C)C)OC(C)(C)C)C(=O)C(=O)NCC(=O)N[C@H](C(=O)N(C)C)c1ccccc1
InChI Key: InChIKey=CCCPJDHTMQAJPJ-CMMMQLPKSA-N
Data: 1 KI
Activity Spreadsheet -- Enzyme Inhibition Constant Data from BindingDB
Found 1 hit for monomerid = 9683
Trg + Lig
Ki
nM
ΔG°
kcal/mole
IC50
nM
Kd
nM
EC50/IC50
nM
koff
s-1
kon
M-1s-1
pHTemp
°C
HCV NS3-NS4A Serine Proteinase
(Hepatitis C virus (HCV genotype 1a, isolate H))
BDBM9683
(2-methylpropyl N-[(2S)-1-[(2S,4R)-4-(tert-butoxy)-...)
Show SMILES CCCC(NC(=O)[C@@H]1C[C@H](CN1C(=O)[C@@H](NC(=O)OCC(C)C)C(C)(C)C)OC(C)(C)C)C(=O)C(=O)NCC(=O)N[C@H](C(=O)N(C)C)c1ccccc1 |r|
Show InChI InChI=1S/C38H60N6O9/c1-12-16-26(30(46)33(48)39-20-28(45)41-29(34(49)43(10)11)24-17-14-13-15-18-24)40-32(47)27-19-25(53-38(7,8)9)21-44(27)35(50)31(37(4,5)6)42-36(51)52-22-23(2)3/h13-15,17-18,23,25-27,29,31H,12,16,19-22H2,1-11H3,(H,39,48)(H,40,47)(H,41,45)(H,42,51)/t25-,26?,27+,29+,31-/m1/s1
19 -10.7n/an/an/an/an/a6.530
Schering-Plough Research Institute
Assay Description
Proteolytic cleavage of the ester linkage between the Nva (L-norvaline) and the chromophore (PAP) was monitored for change in absorbance at 370 nm. I...
J Med Chem 49: 2750-7 (2006)
Article DOI: 10.1021/jm060077j
BindingDB Entry DOI: 10.7270/Q2V98691