BDBM9691 SCH446211 (SCH6)::TERT-BUTYL [(1S)-1-({(1R,2S,5S)-2-[(3S,10S)-3-(CYCLOPROPYLMETHYL)-12-METHYL-4,5,8,11-TETRAOXO-10-PHENYL-2,6,9,12-TETRAAZATRIDECAN-1-OYL]-6,6-DIMETHYL-3-AZABICYCLO[3.1.0]HEX-3-YL}CARBONYL)-2,2-DIMETHYLPROPYL]CARBAMATE::tert-butyl N-[(2S)-1-[(1R,2S,5S)-2-{[(2S)-3-cyclopropyl-1-[({[(S)-(dimethylcarbamoyl)(phenyl)methyl]carbamoyl}methyl)carbamoyl]-1-oxopropan-2-yl]carbamoyl}-6,6-dimethyl-3-azabicyclo[3.1.0]hexan-3-yl]-3,3-dimethyl-1-oxobutan-2-yl]carbamate
SMILES: CN(C)C(=O)[C@@H](NC(=O)CNC(=O)C(=O)[C@H](CC1CC1)NC(=O)[C@@H]1[C@@H]2[C@H](CN1C(=O)[C@@H](NC(=O)OC(C)(C)C)C(C)(C)C)C2(C)C)c1ccccc1
InChI Key: InChIKey=WHFNHDUMWYGJDL-WYFABNACSA-N
Data: 1 KI
PDB links: 1 PDB ID matches this monomer. 1 PDB ID contains inhibitors having a similarity of 90% to this monomer.
Activity Spreadsheet -- Enzyme Inhibition Constant Data from BindingDB
Found 1 hit for monomerid = 9691
Trg + Lig
Ki
nM
ΔG°
kcal/mole
IC50
nM
Kd
nM
EC50/IC50
nM
koff
s-1
kon
M-1s-1
pHTemp
°C
HCV NS3-NS4A Serine Proteinase
(Hepatitis C virus (HCV genotype 1a, isolate H))
BDBM9691
(SCH446211 (SCH6) | TERT-BUTYL [(1S)-1-({(1R,2S,5S)...)
Show SMILES CN(C)C(=O)[C@@H](NC(=O)CNC(=O)C(=O)[C@H](CC1CC1)NC(=O)[C@@H]1[C@@H]2[C@H](CN1C(=O)[C@@H](NC(=O)OC(C)(C)C)C(C)(C)C)C2(C)C)c1ccccc1 |r|
Show InChI InChI=1S/C38H56N6O8/c1-36(2,3)30(42-35(51)52-37(4,5)6)34(50)44-20-23-26(38(23,7)8)28(44)31(47)40-24(18-21-16-17-21)29(46)32(48)39-19-25(45)41-27(33(49)43(9)10)22-14-12-11-13-15-22/h11-15,21,23-24,26-28,30H,16-20H2,1-10H3,(H,39,48)(H,40,47)(H,41,45)(H,42,51)/t23-,24-,26-,27-,28-,30+/m0/s1
3.80 -11.7n/an/an/an/an/a6.530
Schering-Plough Research Institute
Assay Description
Proteolytic cleavage of the ester linkage between the Nva (L-norvaline) and the chromophore (PAP) was monitored for change in absorbance at 370 nm. I...
J Med Chem 49: 2750-7 (2006)
Article DOI: 10.1021/jm060077j
BindingDB Entry DOI: 10.7270/Q2V98691
3D
3D Structure (crystal)