BDBM9753 2-aza-bicyclo[2.2.1]heptane-3-carboxylic acid deriv. 24::tert-butyl N-[(2S)-1-[(3S)-3-({3-cyclopropyl-1-[({[(S)-(dimethylcarbamoyl)(phenyl)methyl]carbamoyl}methyl)carbamoyl]-1-oxopropan-2-yl}carbamoyl)-2-azabicyclo[2.2.1]heptan-2-yl]-3,3-dimethyl-1-oxobutan-2-yl]carbamate
SMILES: CN(C)C(=O)[C@@H](NC(=O)CNC(=O)C(=O)C(CC1CC1)NC(=O)[C@@H]1C2CCC(C2)N1C(=O)[C@@H](NC(=O)OC(C)(C)C)C(C)(C)C)c1ccccc1
InChI Key: InChIKey=QHFTWQLONUZXEB-UKRMLWEFSA-N
Data: 1 KI
PDB links: 3 PDB IDs contain inhibitors having a similarity of 90% to this monomer.
Activity Spreadsheet -- Enzyme Inhibition Constant Data from BindingDB
Found 1 hit for monomerid = 9753
Trg + Lig
Ki
nM
ΔG°
kcal/mole
IC50
nM
Kd
nM
EC50/IC50
nM
koff
s-1
kon
M-1s-1
pHTemp
°C
HCV NS3-NS4A Serine Proteinase
(Hepatitis C virus (HCV genotype 1a, isolate H))
BDBM9753
(2-aza-bicyclo[2.2.1]heptane-3-carboxylic acid deri...)
Show SMILES CN(C)C(=O)[C@@H](NC(=O)CNC(=O)C(=O)C(CC1CC1)NC(=O)[C@@H]1C2CCC(C2)N1C(=O)[C@@H](NC(=O)OC(C)(C)C)C(C)(C)C)c1ccccc1 |r,TLB:30:29:26.25:28,THB:21:23:26.25:28|
Show InChI InChI=1S/C37H54N6O8/c1-36(2,3)30(41-35(50)51-37(4,5)6)34(49)43-24-17-16-23(19-24)28(43)31(46)39-25(18-21-14-15-21)29(45)32(47)38-20-26(44)40-27(33(48)42(7)8)22-12-10-9-11-13-22/h9-13,21,23-25,27-28,30H,14-20H2,1-8H3,(H,38,47)(H,39,46)(H,40,44)(H,41,50)/t23?,24?,25?,27-,28-,30+/m0/s1
19 -10.7n/an/an/an/an/a6.530
Schering-Plough Research Institute
Assay Description
Proteolytic cleavage of the ester linkage between the Nva (L-norvaline) and the chromophore (PAP) was monitored for change in absorbance at 370 nm. I...
Bioorg Med Chem Lett 16: 1628-32 (2006)
Article DOI: 10.1016/j.bmcl.2005.12.046
BindingDB Entry DOI: 10.7270/Q2B856BB