BDBM9760 2-aza-bicyclo[2.2.1]heptane-3-carboxylic acid deriv. 36::3-{[(3S)-2-[(2S)-2-[(tert-butylcarbamoyl)amino]-2-cyclohexylacetyl]-2-azabicyclo[2.2.1]heptan-3-yl]formamido}-4-cyclopropyl-N-({[(S)-(dimethylcarbamoyl)(phenyl)methyl]carbamoyl}methyl)-2-oxobutanamide
SMILES: CN(C)C(=O)[C@@H](NC(=O)CNC(=O)C(=O)C(CC1CC1)NC(=O)[C@@H]1C2CCC(C2)N1C(=O)[C@@H](NC(=O)NC(C)(C)C)C1CCCCC1)c1ccccc1
InChI Key: InChIKey=FJEAZKCECWSFQB-DOCQBQAVSA-N
Data: 1 KI
Activity Spreadsheet -- Enzyme Inhibition Constant Data from BindingDB
Found 1 hit for monomerid = 9760
Trg + Lig
Ki
nM
ΔG°
kcal/mole
IC50
nM
Kd
nM
EC50/IC50
nM
koff
s-1
kon
M-1s-1
pHTemp
°C
HCV NS3-NS4A Serine Proteinase
(Hepatitis C virus (HCV genotype 1a, isolate H))
BDBM9760
(2-aza-bicyclo[2.2.1]heptane-3-carboxylic acid deri...)
Show SMILES CN(C)C(=O)[C@@H](NC(=O)CNC(=O)C(=O)C(CC1CC1)NC(=O)[C@@H]1C2CCC(C2)N1C(=O)[C@@H](NC(=O)NC(C)(C)C)C1CCCCC1)c1ccccc1 |r,TLB:30:29:26.25:28,THB:21:23:26.25:28|
Show InChI InChI=1S/C39H57N7O7/c1-39(2,3)44-38(53)43-31(25-14-10-7-11-15-25)37(52)46-27-19-18-26(21-27)32(46)34(49)41-28(20-23-16-17-23)33(48)35(50)40-22-29(47)42-30(36(51)45(4)5)24-12-8-6-9-13-24/h6,8-9,12-13,23,25-28,30-32H,7,10-11,14-22H2,1-5H3,(H,40,50)(H,41,49)(H,42,47)(H2,43,44,53)/t26?,27?,28?,30-,31-,32-/m0/s1
19 -10.7n/an/an/an/an/a6.530
Schering-Plough Research Institute
Assay Description
Proteolytic cleavage of the ester linkage between the Nva (L-norvaline) and the chromophore (PAP) was monitored for change in absorbance at 370 nm. I...
Bioorg Med Chem Lett 16: 1628-32 (2006)
Article DOI: 10.1016/j.bmcl.2005.12.046
BindingDB Entry DOI: 10.7270/Q2B856BB