BDBM97623 US8470841, 52
SMILES: CC(C)Oc1ccc(OC2CCC(CCC(C)NC(C)=O)CC2)cn1
InChI Key: InChIKey=BGSSITZNPKHFTP-UHFFFAOYSA-N
Data: 1 IC50
Activity Spreadsheet -- Enzyme Inhibition Constant Data from BindingDB
Found 1 hit for monomerid = 97623
Trg + Lig
Ki
nM
ΔG°
kcal/mole
IC50
nM
Kd
nM
EC50/IC50
nM
koff
s-1
kon
M-1s-1
pHTemp
°C
Acetyl-CoA carboxylase 2 (ACC2)
(Homo sapiens (Human))
BDBM97623
(US8470841, 52)
Show SMILES CC(C)Oc1ccc(OC2CCC(CCC(C)NC(C)=O)CC2)cn1 |(-10,-.77,;-8.67,,;-8.67,1.54,;-7.34,-.77,;-6,,;-6,1.54,;-4.67,2.31,;-3.33,1.54,;-2,2.31,;-.67,1.54,;-.67,,;.67,-.77,;2,,;3.33,-.77,;4.67,,;6,-.77,;6,-2.31,;7.34,,;8.67,-.77,;8.67,-2.31,;10,,;2,1.54,;.67,2.31,;-3.33,,;-4.67,-.77,)|
Show InChI InChI=1S/C20H32N2O3/c1-14(2)24-20-12-11-19(13-21-20)25-18-9-7-17(8-10-18)6-5-15(3)22-16(4)23/h11-15,17-18H,5-10H2,1-4H3,(H,22,23)
US Patent
n/an/a 80n/an/an/an/a7.537
Sanofi
US Patent
Assay Description
the enzymatic activity of ACC and its inhibition by test substances were determined by a luminometric assay.
US Patent US8470841 (2013)
BindingDB Entry DOI: 10.7270/Q2183537