BDBM97710 US8476271, 16::US9145408, 362
SMILES: OC(=O)c1nc2ccccc2n([C@@H]2C[C@@H]3CCC[C@H](C2)N3C2CC3CCCC(C3)C2)c1=O
InChI Key: InChIKey=COTYYZPYDJKKIS-KQMWNOITSA-N
Data: 8 KI  3 EC50
Activity Spreadsheet -- Enzyme Inhibition Constant Data from BindingDB
Found 11 hits for monomerid = 97710
Trg + Lig
Ki
nM
ΔG°
kcal/mole
IC50
nM
Kd
nM
EC50/IC50
nM
koff
s-1
kon
M-1s-1
pHTemp
°C
Opioid growth factor receptor-like protein 1
(Homo sapiens (Human))
BDBM97710
(US8476271, 16 | US9145408, 362)
Show SMILES OC(=O)c1nc2ccccc2n([C@@H]2C[C@@H]3CCC[C@H](C2)N3C2CC3CCCC(C3)C2)c1=O |r,TLB:11:12:20:15.17.16,THB:20:21:28:25.24.26|
Show InChI InChI=1S/C26H33N3O3/c30-25-24(26(31)32)27-22-9-1-2-10-23(22)29(25)21-14-18-7-4-8-19(15-21)28(18)20-12-16-5-3-6-17(11-16)13-20/h1-2,9-10,16-21H,3-8,11-15H2,(H,31,32)/t16?,17?,18-,19+,20?,21+
US Patent
2.40 -10.9n/an/an/an/an/a7.44
Purdue Pharma L.P.; Shionogi & Co., Ltd.
US Patent
Assay Description
ORL-1 Receptor Binding Assay Procedures: Membranes from recombinant HEK-293 cells expressing the human opioid receptor-like receptor (ORL-1) (Recepto...
US Patent US9145408 (2015)
BindingDB Entry DOI: 10.7270/Q2DJ5DD3
Nociceptin receptor
(Homo sapiens (Human))
BDBM97710
(US8476271, 16 | US9145408, 362)
Show SMILES OC(=O)c1nc2ccccc2n([C@@H]2C[C@@H]3CCC[C@H](C2)N3C2CC3CCCC(C3)C2)c1=O |r,TLB:11:12:20:15.17.16,THB:20:21:28:25.24.26|
Show InChI InChI=1S/C26H33N3O3/c30-25-24(26(31)32)27-22-9-1-2-10-23(22)29(25)21-14-18-7-4-8-19(15-21)28(18)20-12-16-5-3-6-17(11-16)13-20/h1-2,9-10,16-21H,3-8,11-15H2,(H,31,32)/t16?,17?,18-,19+,20?,21+
Reactome pathway
US Patent
2.40 -11.8n/an/an/an/an/a7.425
Purdue Pharma, L.P.; Shionogi & Co., Ltd.
US Patent
Assay Description
In vitro binding assay using ORL-1m Mu-opioid, kappa-opioid, and delta-opioid receptor.
US Patent US8476271 (2013)
BindingDB Entry DOI: 10.7270/Q2416VNB
Mu-type opioid receptor
(Homo sapiens (Human))
BDBM97710
(US8476271, 16 | US9145408, 362)
Show SMILES OC(=O)c1nc2ccccc2n([C@@H]2C[C@@H]3CCC[C@H](C2)N3C2CC3CCCC(C3)C2)c1=O |r,TLB:11:12:20:15.17.16,THB:20:21:28:25.24.26|
Show InChI InChI=1S/C26H33N3O3/c30-25-24(26(31)32)27-22-9-1-2-10-23(22)29(25)21-14-18-7-4-8-19(15-21)28(18)20-12-16-5-3-6-17(11-16)13-20/h1-2,9-10,16-21H,3-8,11-15H2,(H,31,32)/t16?,17?,18-,19+,20?,21+
NCI pathway
Reactome pathway
US Patent
1.63E+3 -7.89n/an/an/an/an/a7.425
Purdue Pharma, L.P.; Shionogi & Co., Ltd.
US Patent
Assay Description
In vitro binding assay using ORL-1m Mu-opioid, kappa-opioid, and delta-opioid receptor.
US Patent US8476271 (2013)
BindingDB Entry DOI: 10.7270/Q2416VNB
Mu-type opioid receptor
(Homo sapiens (Human))
BDBM97710
(US8476271, 16 | US9145408, 362)
Show SMILES OC(=O)c1nc2ccccc2n([C@@H]2C[C@@H]3CCC[C@H](C2)N3C2CC3CCCC(C3)C2)c1=O |r,TLB:11:12:20:15.17.16,THB:20:21:28:25.24.26|
Show InChI InChI=1S/C26H33N3O3/c30-25-24(26(31)32)27-22-9-1-2-10-23(22)29(25)21-14-18-7-4-8-19(15-21)28(18)20-12-16-5-3-6-17(11-16)13-20/h1-2,9-10,16-21H,3-8,11-15H2,(H,31,32)/t16?,17?,18-,19+,20?,21+
NCI pathway
Reactome pathway
US Patent
1.63E+3 -7.89n/an/an/an/an/a7.425
Purdue Pharma L.P.; Shionogi & Co., Ltd.
US Patent
Assay Description
mu-Opioid Receptor Binding Assay Procedures: Radioligand dose-displacement binding assays for mu-opioid receptors used 0.2 nM[3H]-diprenorphine (NEN,...
US Patent US9145408 (2015)
BindingDB Entry DOI: 10.7270/Q2DJ5DD3
Kappa-type opioid receptor
(Homo sapiens (Human))
BDBM97710
(US8476271, 16 | US9145408, 362)
Show SMILES OC(=O)c1nc2ccccc2n([C@@H]2C[C@@H]3CCC[C@H](C2)N3C2CC3CCCC(C3)C2)c1=O |r,TLB:11:12:20:15.17.16,THB:20:21:28:25.24.26|
Show InChI InChI=1S/C26H33N3O3/c30-25-24(26(31)32)27-22-9-1-2-10-23(22)29(25)21-14-18-7-4-8-19(15-21)28(18)20-12-16-5-3-6-17(11-16)13-20/h1-2,9-10,16-21H,3-8,11-15H2,(H,31,32)/t16?,17?,18-,19+,20?,21+
Reactome pathway
US Patent
2.28E+3 -7.69n/an/an/an/an/a7.425
Purdue Pharma, L.P.; Shionogi & Co., Ltd.
US Patent
Assay Description
In vitro binding assay using ORL-1m Mu-opioid, kappa-opioid, and delta-opioid receptor.
US Patent US8476271 (2013)
BindingDB Entry DOI: 10.7270/Q2416VNB
Kappa-type opioid receptor
(Homo sapiens (Human))
BDBM97710
(US8476271, 16 | US9145408, 362)
Show SMILES OC(=O)c1nc2ccccc2n([C@@H]2C[C@@H]3CCC[C@H](C2)N3C2CC3CCCC(C3)C2)c1=O |r,TLB:11:12:20:15.17.16,THB:20:21:28:25.24.26|
Show InChI InChI=1S/C26H33N3O3/c30-25-24(26(31)32)27-22-9-1-2-10-23(22)29(25)21-14-18-7-4-8-19(15-21)28(18)20-12-16-5-3-6-17(11-16)13-20/h1-2,9-10,16-21H,3-8,11-15H2,(H,31,32)/t16?,17?,18-,19+,20?,21+
Reactome pathway
US Patent
2.28E+3 -7.15n/an/an/an/an/a7.44
Purdue Pharma L.P.; Shionogi & Co., Ltd.
US Patent
Assay Description
Alpha-Opioid Receptor Binding Assay Procedures: Membranes from recombinant HEK-293 cells expressing the human kappa opioid receptor (kappa) (cloned i...
US Patent US9145408 (2015)
BindingDB Entry DOI: 10.7270/Q2DJ5DD3
Delta-type opioid receptor
(Homo sapiens (Human))
BDBM97710
(US8476271, 16 | US9145408, 362)
Show SMILES OC(=O)c1nc2ccccc2n([C@@H]2C[C@@H]3CCC[C@H](C2)N3C2CC3CCCC(C3)C2)c1=O |r,TLB:11:12:20:15.17.16,THB:20:21:28:25.24.26|
Show InChI InChI=1S/C26H33N3O3/c30-25-24(26(31)32)27-22-9-1-2-10-23(22)29(25)21-14-18-7-4-8-19(15-21)28(18)20-12-16-5-3-6-17(11-16)13-20/h1-2,9-10,16-21H,3-8,11-15H2,(H,31,32)/t16?,17?,18-,19+,20?,21+
Reactome pathway
US Patent
4.76E+3 -7.26n/an/an/an/an/a7.425
Purdue Pharma L.P.; Shionogi & Co., Ltd.
US Patent
Assay Description
Beta-Opioid Receptor Binding Assay Procedures: Radioligand dose-displacement assays used 0.2 nM [3H]-Naltrindole (NEN; 33.0 Ci/mmole) with 10-20 ug m...
US Patent US9145408 (2015)
BindingDB Entry DOI: 10.7270/Q2DJ5DD3
Kappa-type opioid receptor
(Homo sapiens (Human))
BDBM97710
(US8476271, 16 | US9145408, 362)
Show SMILES OC(=O)c1nc2ccccc2n([C@@H]2C[C@@H]3CCC[C@H](C2)N3C2CC3CCCC(C3)C2)c1=O |r,TLB:11:12:20:15.17.16,THB:20:21:28:25.24.26|
Show InChI InChI=1S/C26H33N3O3/c30-25-24(26(31)32)27-22-9-1-2-10-23(22)29(25)21-14-18-7-4-8-19(15-21)28(18)20-12-16-5-3-6-17(11-16)13-20/h1-2,9-10,16-21H,3-8,11-15H2,(H,31,32)/t16?,17?,18-,19+,20?,21+
Reactome pathway
US Patent
4.76E+3 -7.26n/an/an/an/an/a7.425
Purdue Pharma, L.P.; Shionogi & Co., Ltd.
US Patent
Assay Description
In vitro binding assay using ORL-1m Mu-opioid, kappa-opioid, and delta-opioid receptor.
US Patent US8476271 (2013)
BindingDB Entry DOI: 10.7270/Q2416VNB
Kappa-type opioid receptor
(Homo sapiens (Human))
BDBM97710
(US8476271, 16 | US9145408, 362)
Show SMILES OC(=O)c1nc2ccccc2n([C@@H]2C[C@@H]3CCC[C@H](C2)N3C2CC3CCCC(C3)C2)c1=O |r,TLB:11:12:20:15.17.16,THB:20:21:28:25.24.26|
Show InChI InChI=1S/C26H33N3O3/c30-25-24(26(31)32)27-22-9-1-2-10-23(22)29(25)21-14-18-7-4-8-19(15-21)28(18)20-12-16-5-3-6-17(11-16)13-20/h1-2,9-10,16-21H,3-8,11-15H2,(H,31,32)/t16?,17?,18-,19+,20?,21+
Reactome pathway
US Patent
n/an/an/an/a>2.00E+4n/an/a7.425
Purdue Pharma L.P.; Shionogi & Co., Ltd.
US Patent
Assay Description
Alpha-Opioid Receptor Functional Assay Procedures: Functional [35S]GTPgammaS binding assays were conducted as follows. Kappa opioid receptor membrane...
US Patent US9145408 (2015)
BindingDB Entry DOI: 10.7270/Q2DJ5DD3
Opioid growth factor receptor-like protein 1
(Homo sapiens (Human))
BDBM97710
(US8476271, 16 | US9145408, 362)
Show SMILES OC(=O)c1nc2ccccc2n([C@@H]2C[C@@H]3CCC[C@H](C2)N3C2CC3CCCC(C3)C2)c1=O |r,TLB:11:12:20:15.17.16,THB:20:21:28:25.24.26|
Show InChI InChI=1S/C26H33N3O3/c30-25-24(26(31)32)27-22-9-1-2-10-23(22)29(25)21-14-18-7-4-8-19(15-21)28(18)20-12-16-5-3-6-17(11-16)13-20/h1-2,9-10,16-21H,3-8,11-15H2,(H,31,32)/t16?,17?,18-,19+,20?,21+
US Patent
n/an/an/an/a 4.03n/an/a7.44
Purdue Pharma L.P.; Shionogi & Co., Ltd.
US Patent
Assay Description
ORL-1 Receptor [35S]GTPγS Binding Assay Procedures: Membranes from recombinant HEK-293 cells expressing the human opioid receptor-like (ORL-1) (...
US Patent US9145408 (2015)
BindingDB Entry DOI: 10.7270/Q2DJ5DD3
Mu-type opioid receptor
(Homo sapiens (Human))
BDBM97710
(US8476271, 16 | US9145408, 362)
Show SMILES OC(=O)c1nc2ccccc2n([C@@H]2C[C@@H]3CCC[C@H](C2)N3C2CC3CCCC(C3)C2)c1=O |r,TLB:11:12:20:15.17.16,THB:20:21:28:25.24.26|
Show InChI InChI=1S/C26H33N3O3/c30-25-24(26(31)32)27-22-9-1-2-10-23(22)29(25)21-14-18-7-4-8-19(15-21)28(18)20-12-16-5-3-6-17(11-16)13-20/h1-2,9-10,16-21H,3-8,11-15H2,(H,31,32)/t16?,17?,18-,19+,20?,21+
NCI pathway
Reactome pathway
US Patent
n/an/an/an/a>2.00E+4n/an/a7.425
Purdue Pharma L.P.; Shionogi & Co., Ltd.
US Patent
Assay Description
Mu-Opioid Receptor Functional Assay Procedures: [35S]GTP gamma S functional assays were conducted using freshly thawed mu-receptor membranes. Assay r...
US Patent US9145408 (2015)
BindingDB Entry DOI: 10.7270/Q2DJ5DD3