BDBM97731 US8481564, 7
SMILES: CN1CC(CN(C)C1=O)c1ccc(NC(=O)c2nc(c[nH]2)C#N)c(c1)C1=CCCCC1
InChI Key: InChIKey=KTIDYOCMXQLLFW-UHFFFAOYSA-N
Data: 1 IC50
Activity Spreadsheet -- Enzyme Inhibition Constant Data from BindingDB
Found 1 hit for monomerid = 97731
Trg + Lig
Ki
nM
ΔG°
kcal/mole
IC50
nM
Kd
nM
EC50/IC50
nM
koff
s-1
kon
M-1s-1
pHTemp
°C
Macrophage colony-stimulating factor 1 (CSF-1)
(Mus musculus (Mouse))
BDBM97731
(US8481564, 7)
Show SMILES CN1CC(CN(C)C1=O)c1ccc(NC(=O)c2nc(c[nH]2)C#N)c(c1)C1=CCCCC1 |t:28|
Show InChI InChI=1S/C23H26N6O2/c1-28-13-17(14-29(2)23(28)31)16-8-9-20(19(10-16)15-6-4-3-5-7-15)27-22(30)21-25-12-18(11-24)26-21/h6,8-10,12,17H,3-5,7,13-14H2,1-2H3,(H,25,26)(H,27,30)
US Patent
n/an/a 1n/an/an/an/a7.5n/a
Janssen Pharmaceutica, N.V.
US Patent
Assay Description
A fluorescence polarization competition immunoassay was used to measure compound inhibition of CSF-1R phosphorylation of tyrosine on a synthetic CSF-...
US Patent US8481564 (2013)
BindingDB Entry DOI: 10.7270/Q2QV3K4Q