BDBM97760 US8476225, 21
SMILES: CC(C)(C)[C@H](NC(=O)OC1CCCC1)C(=O)N1CN(C[C@H]1C(=O)N[C@@]1(C[C@H]1C=C)C(=O)NS(=O)(=O)C1CC1)S(=O)(=O)c1ccc(cc1)C(F)(F)F
InChI Key: InChIKey=COBLRIDFIJPBES-DPSVNRJGSA-N
Data: 1 IC50
Activity Spreadsheet -- Enzyme Inhibition Constant Data from BindingDB
Found 1 hit for monomerid = 97760
Trg + Lig
Ki
nM
ΔG°
kcal/mole
IC50
nM
Kd
nM
EC50/IC50
nM
koff
s-1
kon
M-1s-1
pHTemp
°C
Genome polyprotein [1027-1657]
(Hepatitis C virus genotype 1a (isolate 1) (HCV))
BDBM97760
(US8476225, 21)
Show SMILES CC(C)(C)[C@H](NC(=O)OC1CCCC1)C(=O)N1CN(C[C@H]1C(=O)N[C@@]1(C[C@H]1C=C)C(=O)NS(=O)(=O)C1CC1)S(=O)(=O)c1ccc(cc1)C(F)(F)F |r|
Show InChI InChI=1S/C32H42F3N5O9S2/c1-5-19-16-31(19,28(43)38-50(45,46)22-14-15-22)37-26(41)24-17-39(51(47,48)23-12-10-20(11-13-23)32(33,34)35)18-40(24)27(42)25(30(2,3)4)36-29(44)49-21-8-6-7-9-21/h5,10-13,19,21-22,24-25H,1,6-9,14-18H2,2-4H3,(H,36,44)(H,37,41)(H,38,43)/t19-,24+,25-,31-/m1/s1
US Patent
n/an/a 4n/an/an/an/a7.537
Gilead Sciences, Inc.
US Patent
Assay Description
Inhibition assay using HCV protease.
US Patent US8476225 (2013)
BindingDB Entry DOI: 10.7270/Q2M32TD9