BDBM97926 US8481536, 493::US8481536, 609
SMILES: Cc1cc2nc(Nc3ccc(cc3)S(=O)(=O)NCCN3CCCC3)nnc2cc1-c1cc(O)ccc1Cl
InChI Key: InChIKey=XSYZCQDIHCJKAQ-UHFFFAOYSA-N
Data: 2 IC50
Activity Spreadsheet -- Enzyme Inhibition Constant Data from BindingDB
Found 2 hits for monomerid = 97926
Trg + Lig
Ki
nM
ΔG°
kcal/mole
IC50
nM
Kd
nM
EC50/IC50
nM
koff
s-1
kon
M-1s-1
pHTemp
°C
Platelet-derived growth factor receptor beta
(Homo sapiens (Human))
BDBM97926
(US8481536, 493 | US8481536, 609)
Show SMILES Cc1cc2nc(Nc3ccc(cc3)S(=O)(=O)NCCN3CCCC3)nnc2cc1-c1cc(O)ccc1Cl
Show InChI InChI=1S/C26H27ClN6O3S/c1-17-14-24-25(16-21(17)22-15-19(34)6-9-23(22)27)31-32-26(30-24)29-18-4-7-20(8-5-18)37(35,36)28-10-13-33-11-2-3-12-33/h4-9,14-16,28,34H,2-3,10-13H2,1H3,(H,29,30,32)
NCI pathway
Reactome pathway
US Patent
n/an/a 1.90n/an/an/an/an/an/a
TargeGen, Inc.
US Patent
Assay Description
Testing of inhibition of kinases in vitro using luciferase-based assay from KinaseGlo, Promega Corp.
US Patent US8481536 (2013)
BindingDB Entry DOI: 10.7270/Q2GB22PZ
Proto-oncogene tyrosine-protein kinase Src
(Homo sapiens (Human))
BDBM97926
(US8481536, 493 | US8481536, 609)
Show SMILES Cc1cc2nc(Nc3ccc(cc3)S(=O)(=O)NCCN3CCCC3)nnc2cc1-c1cc(O)ccc1Cl
Show InChI InChI=1S/C26H27ClN6O3S/c1-17-14-24-25(16-21(17)22-15-19(34)6-9-23(22)27)31-32-26(30-24)29-18-4-7-20(8-5-18)37(35,36)28-10-13-33-11-2-3-12-33/h4-9,14-16,28,34H,2-3,10-13H2,1H3,(H,29,30,32)
US Patent
n/an/a 1.60n/an/an/an/an/a25
TargeGen, Inc.
US Patent
Assay Description
Testing of inhibition of kinases in vitro using luciferase-based assay from KinaseGlo, Promega Corp.
US Patent US8481536 (2013)
BindingDB Entry DOI: 10.7270/Q2GB22PZ