BDBM97940 US8481536, 510
SMILES: Cc1cc(cc2nnc(Nc3ccc(nc3)N3CCN(CCO)CC3)nc12)-c1cc(O)ccc1Cl
InChI Key: InChIKey=CINXTSWCBIQHCB-UHFFFAOYSA-N
Data: 1 IC50
Activity Spreadsheet -- Enzyme Inhibition Constant Data from BindingDB
Found 1 hit for monomerid = 97940
Trg + Lig
Ki
nM
ΔG°
kcal/mole
IC50
nM
Kd
nM
EC50/IC50
nM
koff
s-1
kon
M-1s-1
pHTemp
°C
Proto-oncogene tyrosine-protein kinase Src
(Homo sapiens (Human))
BDBM97940
(US8481536, 510)
Show SMILES Cc1cc(cc2nnc(Nc3ccc(nc3)N3CCN(CCO)CC3)nc12)-c1cc(O)ccc1Cl
Show InChI InChI=1S/C25H26ClN7O2/c1-16-12-17(20-14-19(35)3-4-21(20)26)13-22-24(16)29-25(31-30-22)28-18-2-5-23(27-15-18)33-8-6-32(7-9-33)10-11-34/h2-5,12-15,34-35H,6-11H2,1H3,(H,28,29,31)
US Patent
n/an/a 1.80n/an/an/an/an/a25
TargeGen, Inc.
US Patent
Assay Description
Testing of inhibition of kinases in vitro using luciferase-based assay from KinaseGlo, Promega Corp.
US Patent US8481536 (2013)
BindingDB Entry DOI: 10.7270/Q2GB22PZ