BDBM98802 US8487093, 192
SMILES: OS(=O)(=O)ON1[C@H]2CN([C@@H](CC2)C(=O)Nc2cc(ccn2)C2CCNCC2)C1=O
InChI Key: InChIKey=IVIBSXDLKKQASQ-KGLIPLIRSA-N
Data: 2 IC50
Activity Spreadsheet -- Enzyme Inhibition Constant Data from BindingDB
Found 2 hits for monomerid = 98802
Trg + Lig
Ki
nM
ΔG°
kcal/mole
IC50
nM
Kd
nM
EC50/IC50
nM
koff
s-1
kon
M-1s-1
pHTemp
°C
Beta-lactamase (AmpC)
(Pseudomonas aeruginosa)
BDBM98802
(US8487093, 192)
Show SMILES OS(=O)(=O)ON1[C@H]2CN([C@@H](CC2)C(=O)Nc2cc(ccn2)C2CCNCC2)C1=O |r|
Show InChI InChI=1S/C17H23N5O6S/c23-16(20-15-9-12(5-8-19-15)11-3-6-18-7-4-11)14-2-1-13-10-21(14)17(24)22(13)28-29(25,26)27/h5,8-9,11,13-14,18H,1-4,6-7,10H2,(H,19,20,23)(H,25,26,27)/t13-,14+/m1/s1
US Patent
n/an/a 0.800n/an/an/an/an/an/a
Merck Sharp & Dohme Corp.
US Patent
Assay Description
Enzyme activities were measured in the presence of the test inhibitor in spectrophotometric assay.
US Patent US8487093 (2013)
BindingDB Entry DOI: 10.7270/Q2057DKK
Beta-lactamase (KPC-2)
(Klebsiella pneumoniae)
BDBM98802
(US8487093, 192)
Show SMILES OS(=O)(=O)ON1[C@H]2CN([C@@H](CC2)C(=O)Nc2cc(ccn2)C2CCNCC2)C1=O |r|
Show InChI InChI=1S/C17H23N5O6S/c23-16(20-15-9-12(5-8-19-15)11-3-6-18-7-4-11)14-2-1-13-10-21(14)17(24)22(13)28-29(25,26)27/h5,8-9,11,13-14,18H,1-4,6-7,10H2,(H,19,20,23)(H,25,26,27)/t13-,14+/m1/s1
US Patent
n/an/a 470n/an/an/an/an/an/a
Merck Sharp & Dohme Corp.
US Patent
Assay Description
Enzyme activities were measured in the presence of the test inhibitor in spectrophotometric assay.
US Patent US8487093 (2013)
BindingDB Entry DOI: 10.7270/Q2057DKK